{"text_format":"1","workbook":"xlsx","n_sheets":12,"sheets":["DB","Auswahl","Einkauf","Liste","ZWtab","Version","11","12","14","17","20","Maßtabellen"],"not_rendered":{"charts":0,"images":6,"macros":1,"external_links":0,"defined_names":7,"comments":1,"pivot_tables":0},"unopened":[],"bounds":{"document_bytes":16777216,"sheet_cells":100000,"rows_first":2000,"rows_last":500,"rows_between":2000,"halvings":0,"cell_chars":16384,"cell_head_chars":4096},"cells_cut":0,"cells_raw":0,"read":"whole","date_system":"1900"}

{"sheet":"DB","index":0,"n_rows":36,"n_cols":9,"rows_kept":36,"cut":false,"hidden":false,"merged":[[4,1,4,8],[5,1,5,8]]}
[]
[]
[]
[]
[null,"Rezeptsammlung "]
[null,"Weihnachtsplätzchen"]
[]
[null,null,null,null,null,null,{"$f":"COUNTA(Auswahl!$B$3:$B$32)-COUNTBLANK(Auswahl!$B$3:$B$32)&\" Plätzchenrezepte enthalten\"","v":"20 Plätzchenrezepte enthalten"}]
[]
[]
{"$rows_left_out":27}
{"sheet":"Auswahl","index":1,"n_rows":32,"n_cols":7,"rows_kept":32,"cut":false,"hidden":false,"merged":[[0,1,0,2]]}
[null,"Rezept",null,"Auswahl"]
[null,null,"[St.]","[St.]","Ko.","Rezept","Quelle"]
[1,{"$f":"IF(INDEX(Liste!$E$3:$CF$3,A3)=0,\"\",INDEX(Liste!$E$3:$CF$3,A3))","v":"Wiener Vanillekipfel"},{"$f":"IF(INDEX(Liste!$E$5:$CF$5,A3)=0,\"\",INDEX(Liste!$E$5:$CF$5,A3))","v":80},null,{"$f":"IF(C3=0,\"\",IF(OR(D3/C3-INT(D3/C3)=0,D3/C3-INT(D3/C3)=0.5),\"\",\"Fehler\"))","v":""}]
[2,{"$f":"IF(INDEX(Liste!$E$3:$CF$3,A4)=0,\"\",INDEX(Liste!$E$3:$CF$3,A4))","v":"Schwarzweißgebäck"},{"$f":"IF(INDEX(Liste!$E$5:$CF$5,A4)=0,\"\",INDEX(Liste!$E$5:$CF$5,A4))","v":80},80,{"$f":"IF(C4=0,\"\",IF(OR(D4/C4-INT(D4/C4)=0,D4/C4-INT(D4/C4)=0.5),\"\",\"Fehler\"))","v":""}]
[3,{"$f":"IF(INDEX(Liste!$E$3:$CF$3,A5)=0,\"\",INDEX(Liste!$E$3:$CF$3,A5))","v":"Brune Kager"},{"$f":"IF(INDEX(Liste!$E$5:$CF$5,A5)=0,\"\",INDEX(Liste!$E$5:$CF$5,A5))","v":100},null,""]
[4,{"$f":"IF(INDEX(Liste!$E$3:$CF$3,A6)=0,\"\",INDEX(Liste!$E$3:$CF$3,A6))","v":"Italienische Pangani"},{"$f":"IF(INDEX(Liste!$E$5:$CF$5,A6)=0,\"\",INDEX(Liste!$E$5:$CF$5,A6))","v":80},null,""]
[5,{"$f":"IF(INDEX(Liste!$E$3:$CF$3,A7)=0,\"\",INDEX(Liste!$E$3:$CF$3,A7))","v":"Marillenringe"},{"$f":"IF(INDEX(Liste!$E$5:$CF$5,A7)=0,0,INDEX(Liste!$E$5:$CF$5,A7))","v":50},null,""]
[6,{"$f":"IF(INDEX(Liste!$E$3:$CF$3,A8)=0,\"\",INDEX(Liste!$E$3:$CF$3,A8))","v":"Elisenlebkuchen"},{"$f":"IF(INDEX(Liste!$E$5:$CF$5,A8)=0,0,INDEX(Liste!$E$5:$CF$5,A8))","v":42},null,""]
[7,{"$f":"IF(INDEX(Liste!$E$3:$CF$3,A9)=0,\"\",INDEX(Liste!$E$3:$CF$3,A9))","v":"Nusshäufchen"},{"$f":"IF(INDEX(Liste!$E$5:$CF$5,A9)=0,0,INDEX(Liste!$E$5:$CF$5,A9))","v":25},25,""]
[8,{"$f":"IF(INDEX(Liste!$E$3:$CF$3,A10)=0,\"\",INDEX(Liste!$E$3:$CF$3,A10))","v":"Marzipanstangen"},{"$f":"IF(INDEX(Liste!$E$5:$CF$5,A10)=0,0,INDEX(Liste!$E$5:$CF$5,A10))","v":50},50,""]
{"$rows_left_out":23}
{"sheet":"Einkauf","index":2,"n_rows":64,"n_cols":11,"rows_kept":64,"cut":false,"hidden":false,"merged":[[1,1,1,10],[4,7,4,10],[5,9,5,10]]}
[]
[null,"Einkaufsliste"]
[]
[]
[null,null,{"$f":"IF(Auswahl!D3=0,\"\",INDEX(Auswahl!$B$3:$B$32,MATCH(Auswahl!A3,Auswahl!$A$3:$A$32),0))","v":""},null,{"$f":"IF(C5=\"\",\"\",INDEX(Auswahl!$D$3:$D$32,MATCH(Auswahl!A3,Auswahl!$A$3:$A$32),0))","v":""},{"$f":"IF(C5=\"\",\"\",\"[St.]\")","v":""},null,"Zutaten"]
[null,null,{"$f":"IF(Auswahl!D4=0,\"\",INDEX(Auswahl!$B$3:$B$32,MATCH(Auswahl!A4,Auswahl!$A$3:$A$32),0))","v":"Schwarzweißgebäck"},null,{"$f":"IF(C6=\"\",\"\",INDEX(Auswahl!$D$3:$D$32,MATCH(Auswahl!A4,Auswahl!$A$3:$A$32),0))","v":80},{"$f":"IF(C6=\"\",\"\",\"[St.]\")","v":"[St.]"},null,"Zutaten","Zusatz","Menge"]
[null,null,{"$f":"IF(Auswahl!D5=0,\"\",INDEX(Auswahl!$B$3:$B$32,MATCH(Auswahl!A5,Auswahl!$A$3:$A$32),0))","v":""},null,{"$f":"IF(C7=\"\",\"\",INDEX(Auswahl!$D$3:$D$32,MATCH(Auswahl!A5,Auswahl!$A$3:$A$32),0))","v":""},{"$f":"IF(C7=\"\",\"\",\"[St.]\")","v":""},null,{"$f":"ZWtab!B7","v":"Mehl"},{"$f":"ZWtab!C7","v":""},{"$f":"IF(ZWtab!A7=0,\"\",ZWtab!A7)","v":1735},{"$f":"ZWtab!D7","v":"[g]"}]
[null,null,{"$f":"IF(Auswahl!D6=0,\"\",INDEX(Auswahl!$B$3:$B$32,MATCH(Auswahl!A6,Auswahl!$A$3:$A$32),0))","v":""},null,{"$f":"IF(C8=\"\",\"\",INDEX(Auswahl!$D$3:$D$32,MATCH(Auswahl!A6,Auswahl!$A$3:$A$32),0))","v":""},"",null,{"$f":"ZWtab!B8","v":"Zucker"},{"$f":"ZWtab!C8","v":""},{"$f":"IF(ZWtab!A8=0,\"\",ZWtab!A8)","v":460},{"$f":"ZWtab!D8","v":"[g]"}]
[null,null,{"$f":"IF(Auswahl!D7=0,\"\",INDEX(Auswahl!$B$3:$B$32,MATCH(Auswahl!A7,Auswahl!$A$3:$A$32),0))","v":""},null,{"$f":"IF(C9=\"\",\"\",INDEX(Auswahl!$D$3:$D$32,MATCH(Auswahl!A7,Auswahl!$A$3:$A$32),0))","v":""},"",null,{"$f":"ZWtab!B9","v":"Butter"},{"$f":"ZWtab!C9","v":""},{"$f":"IF(ZWtab!A9=0,\"\",ZWtab!A9)","v":1195},{"$f":"ZWtab!D9","v":"[g]"}]
[null,null,{"$f":"IF(Auswahl!D8=0,\"\",INDEX(Auswahl!$B$3:$B$32,MATCH(Auswahl!A8,Auswahl!$A$3:$A$32),0))","v":""},null,{"$f":"IF(C10=\"\",\"\",INDEX(Auswahl!$D$3:$D$32,MATCH(Auswahl!A8,Auswahl!$A$3:$A$32),0))","v":""},"",null,{"$f":"ZWtab!B10","v":"Mandeln"},{"$f":"ZWtab!C10","v":"gerieben"},{"$f":"IF(ZWtab!A10=0,\"\",ZWtab!A10)","v":200},{"$f":"ZWtab!D10","v":"[g]"}]
{"$rows_left_out":55}
{"sheet":"Liste","index":3,"n_rows":60,"n_cols":34,"rows_kept":60,"cut":false,"hidden":true,"merged":[]}
[null,null,null,{"$f":"MAX(E1:AH1)","v":15},{"$f":"COUNTIF(E$7:E$100,\">0\")","v":8},5,10,12,10,15,8,11,10,12,{"$f":"COUNTIF(O$7:O$100,\">0\")","v":9},{"$f":"COUNTIF(P$7:P$100,\">0\")","v":7},10,6,8,5,11,8,12,7,0,0,0,0,0,0,0,0,0,0]
[null,null,null,null,{"$f":"COLUMN(E3)-4","v":1},{"$f":"COLUMN(F3)-4","v":2},3,4,5,6,7,8,9,10,11,12,13,14,15,16,17,18,19,{"$f":"COLUMN(X3)-4","v":20},{"$f":"COLUMN(Y3)-4","v":21},{"$f":"COLUMN(Z3)-4","v":22},{"$f":"COLUMN(AA3)-4","v":23},{"$f":"COLUMN(AB3)-4","v":24},{"$f":"COLUMN(AC3)-4","v":25},{"$f":"COLUMN(AD3)-4","v":26},{"$f":"COLUMN(AE3)-4","v":27},{"$f":"COLUMN(AF3)-4","v":28},{"$f":"COLUMN(AG3)-4","v":29},{"$f":"COLUMN(AH3)-4","v":30}]
[null,"Zutaten","Zusatz","Mengen","Wiener Vanillekipfel","Schwarzweißgebäck","Brune Kager","Italienische Pangani","Marillenringe","Elisenlebkuchen","Nusshäufchen","Marzipanstangen","Walnußbusserl","Kokosspiralen","Mandelplätzchen","Trüffelmakronen","Orangen-Schoko-Plätzchen","Kokos-Kipferln","Nusskipferln","Heidesand mit Meersalz","Pistazienschnitten","Marmeladenplätzchen","Grazer Mandelrauten","Marmorhappen"]
[]
[null,null,null,"Stück",80,80,100,80,50,42,25,50,45,40,35,30,40,50,60,100,50,30,50,40]
[]
[null,"Mehl",null,"[g]",300,400,500,500,400,30,250,200,250,220,350,null,200,225,200,400,250,45,300,290]
[null,"Zucker",null,"[g]",100,null,200,300,120,150,null,100,70,120,200,null,100,null,100,210,null,60]
[null,"Butter",null,"[g]",200,300,250,200,250,null,150,125,125,150,200,20,125,200,250,250,100,null,225,150]
[null,"Mandeln","gerieben","[g]",50,null,null,9,null,150,null,null,null,null,null,200]
{"$rows_left_out":51}
{"sheet":"ZWtab","index":4,"n_rows":300,"n_cols":34,"rows_kept":300,"cut":false,"hidden":true,"merged":[]}
[null,null,null,null,{"$f":"COLUMN(E2)-4","v":1},{"$f":"COLUMN(F2)-4","v":2},3,4,5,6,7,8,9,10,11,12,13,14,15,16,17,18,19,20,21,22,23,24,25,26,27,28,29,30]
[null,null,null,null,{"$f":"IF(Liste!E3=\"\",\"\",Liste!E3)","v":"Wiener Vanillekipfel"},{"$f":"IF(Liste!F3=\"\",\"\",Liste!F3)","v":"Schwarzweißgebäck"},{"$f":"IF(Liste!G3=\"\",\"\",Liste!G3)","v":"Brune Kager"},{"$f":"IF(Liste!H3=\"\",\"\",Liste!H3)","v":"Italienische Pangani"},{"$f":"IF(Liste!I3=\"\",\"\",Liste!I3)","v":"Marillenringe"},{"$f":"IF(Liste!J3=\"\",\"\",Liste!J3)","v":"Elisenlebkuchen"},{"$f":"IF(Liste!K3=\"\",\"\",Liste!K3)","v":"Nusshäufchen"},{"$f":"IF(Liste!L3=\"\",\"\",Liste!L3)","v":"Marzipanstangen"},{"$f":"IF(Liste!M3=\"\",\"\",Liste!M3)","v":"Walnußbusserl"},{"$f":"IF(Liste!N3=\"\",\"\",Liste!N3)","v":"Kokosspiralen"},{"$f":"IF(Liste!O3=\"\",\"\",Liste!O3)","v":"Mandelplätzchen"},{"$f":"IF(Liste!P3=\"\",\"\",Liste!P3)","v":"Trüffelmakronen"},{"$f":"IF(Liste!Q3=\"\",\"\",Liste!Q3)","v":"Orangen-Schoko-Plätzchen"},{"$f":"IF(Liste!R3=\"\",\"\",Liste!R3)","v":"Kokos-Kipferln"},{"$f":"IF(Liste!S3=\"\",\"\",Liste!S3)","v":"Nusskipferln"},{"$f":"IF(Liste!T3=\"\",\"\",Liste!T3)","v":"Heidesand mit Meersalz"},{"$f":"IF(Liste!U3=\"\",\"\",Liste!U3)","v":"Pistazienschnitten"},{"$f":"IF(Liste!V3=\"\",\"\",Liste!V3)","v":"Marmeladenplätzchen"},{"$f":"IF(Liste!W3=\"\",\"\",Liste!W3)","v":"Grazer Mandelrauten"},{"$f":"IF(Liste!X3=\"\",\"\",Liste!X3)","v":"Marmorhappen"},{"$f":"IF(Liste!Y3=\"\",\"\",Liste!Y3)","v":""},{"$f":"IF(Liste!Z3=\"\",\"\",Liste!Z3)","v":""},{"$f":"IF(Liste!AA3=\"\",\"\",Liste!AA3)","v":""},{"$f":"IF(Liste!AB3=\"\",\"\",Liste!AB3)","v":""},{"$f":"IF(Liste!AC3=\"\",\"\",Liste!AC3)","v":""},{"$f":"IF(Liste!AD3=\"\",\"\",Liste!AD3)","v":""},{"$f":"IF(Liste!AE3=\"\",\"\",Liste!AE3)","v":""},{"$f":"IF(Liste!AF3=\"\",\"\",Liste!AF3)","v":""},{"$f":"IF(Liste!AG3=\"\",\"\",Liste!AG3)","v":""},{"$f":"IF(Liste!AH3=\"\",\"\",Liste!AH3)","v":""}]
[]
["SUMME","Stück",null,null,{"$f":"IF(Auswahl!$D3=\"\",0,Auswahl!$D3)","v":0},{"$f":"IF(Auswahl!$D4=\"\",0,Auswahl!$D4)","v":80},{"$f":"IF(Auswahl!$D5=\"\",0,Auswahl!$D5)","v":0},{"$f":"IF(Auswahl!$D6=\"\",0,Auswahl!$D6)","v":0},{"$f":"IF(Auswahl!$D7=\"\",0,Auswahl!$D7)","v":0},{"$f":"IF(Auswahl!$D8=\"\",0,Auswahl!$D8)","v":0},{"$f":"IF(Auswahl!$D9=\"\",0,Auswahl!$D9)","v":25},{"$f":"IF(Auswahl!$D10=\"\",0,Auswahl!$D10)","v":50},{"$f":"IF(Auswahl!$D11=\"\",0,Auswahl!$D11)","v":0},{"$f":"IF(Auswahl!$D12=\"\",0,Auswahl!$D12)","v":0},{"$f":"IF(Auswahl!$D13=\"\",0,Auswahl!$D13)","v":35},{"$f":"IF(Auswahl!$D14=\"\",0,Auswahl!$D14)","v":30},{"$f":"IF(Auswahl!$D15=\"\",0,Auswahl!$D15)","v":0},{"$f":"IF(Auswahl!$D16=\"\",0,Auswahl!$D16)","v":0},{"$f":"IF(Auswahl!$D17=\"\",0,Auswahl!$D17)","v":60},{"$f":"IF(Auswahl!$D18=\"\",0,Auswahl!$D18)","v":0},{"$f":"IF(Auswahl!$D19=\"\",0,Auswahl!$D19)","v":0},{"$f":"IF(Auswahl!$D20=\"\",0,Auswahl!$D20)","v":30},{"$f":"IF(Auswahl!$D21=\"\",0,Auswahl!$D21)","v":0},{"$f":"IF(Auswahl!$D22=\"\",0,Auswahl!$D22)","v":40},{"$f":"IF(Auswahl!$D23=\"\",0,Auswahl!$D23)","v":0},{"$f":"IF(Auswahl!$D24=\"\",0,Auswahl!$D24)","v":0},{"$f":"IF(Auswahl!$D25=\"\",0,Auswahl!$D25)","v":0},{"$f":"IF(Auswahl!$D26=\"\",0,Auswahl!$D26)","v":0},{"$f":"IF(Auswahl!$D27=\"\",0,Auswahl!$D27)","v":0},{"$f":"IF(Auswahl!$D28=\"\",0,Auswahl!$D28)","v":0},{"$f":"IF(Auswahl!$D29=\"\",0,Auswahl!$D29)","v":0},{"$f":"IF(Auswahl!$D30=\"\",0,Auswahl!$D30)","v":0},{"$f":"IF(Auswahl!$D31=\"\",0,Auswahl!$D31)","v":0},{"$f":"IF(Auswahl!$D32=\"\",0,Auswahl!$D32)","v":0}]
[null,"Zutaten"]
[null,null,"Zusatz","Runden",0,0,0,0,0,0,0,0,0,0,0,0,0,0,0,0,0,0,0,0,0,0,0,0,0,0,0,0,0,0]
[{"$f":"IF(SUM($E7:$AH7)=0,\"\",SUM($E7:$AH7))","v":1735},{"$f":"IF(Liste!B7=\"\",\"\",Liste!B7)","v":"Mehl"},{"$f":"IF(Liste!C7=\"\",\"\",Liste!C7)","v":""},{"$f":"IF(Liste!D7=\"\",\"\",Liste!D7)","v":"[g]"},{"$f":"IF(E$4=0,\"\",IF(Liste!E7=\"\",\"\",ROUND(E$4/Liste!E$5*Liste!E7,E$6)))","v":""},{"$f":"IF(F$4=0,\"\",IF(Liste!F7=\"\",\"\",ROUND(F$4/Liste!F$5*Liste!F7,F$6)))","v":400},{"$f":"IF(G$4=0,\"\",IF(Liste!G7=\"\",\"\",ROUND(G$4/Liste!G$5*Liste!G7,G$6)))","v":""},{"$f":"IF(H$4=0,\"\",IF(Liste!H7=\"\",\"\",ROUND(H$4/Liste!H$5*Liste!H7,H$6)))","v":""},{"$f":"IF(I$4=0,\"\",IF(Liste!I7=\"\",\"\",ROUND(I$4/Liste!I$5*Liste!I7,I$6)))","v":""},{"$f":"IF(J$4=0,\"\",IF(Liste!J7=\"\",\"\",ROUND(J$4/Liste!J$5*Liste!J7,J$6)))","v":""},{"$f":"IF(K$4=0,\"\",IF(Liste!K7=\"\",\"\",ROUND(K$4/Liste!K$5*Liste!K7,K$6)))","v":250},{"$f":"IF(L$4=0,\"\",IF(Liste!L7=\"\",\"\",ROUND(L$4/Liste!L$5*Liste!L7,L$6)))","v":200},{"$f":"IF(M$4=0,\"\",IF(Liste!M7=\"\",\"\",ROUND(M$4/Liste!M$5*Liste!M7,M$6)))","v":""},{"$f":"IF(N$4=0,\"\",IF(Liste!N7=\"\",\"\",ROUND(N$4/Liste!N$5*Liste!N7,N$6)))","v":""},{"$f":"IF(O$4=0,\"\",IF(Liste!O7=\"\",\"\",ROUND(O$4/Liste!O$5*Liste!O7,O$6)))","v":350},{"$f":"IF(P$4=0,\"\",IF(Liste!P7=\"\",\"\",ROUND(P$4/Liste!P$5*Liste!P7,P$6)))","v":""},{"$f":"IF(Q$4=0,\"\",IF(Liste!Q7=\"\",\"\",ROUND(Q$4/Liste!Q$5*Liste!Q7,Q$6)))","v":""},{"$f":"IF(R$4=0,\"\",IF(Liste!R7=\"\",\"\",ROUND(R$4/Liste!R$5*Liste!R7,R$6)))","v":""},{"$f":"IF(S$4=0,\"\",IF(Liste!S7=\"\",\"\",ROUND(S$4/Liste!S$5*Liste!S7,S$6)))","v":200},{"$f":"IF(T$4=0,\"\",IF(Liste!T7=\"\",\"\",ROUND(T$4/Liste!T$5*Liste!T7,T$6)))","v":""},{"$f":"IF(U$4=0,\"\",IF(Liste!U7=\"\",\"\",ROUND(U$4/Liste!U$5*Liste!U7,U$6)))","v":""},{"$f":"IF(V$4=0,\"\",IF(Liste!V7=\"\",\"\",ROUND(V$4/Liste!V$5*Liste!V7,V$6)))","v":45},{"$f":"IF(W$4=0,\"\",IF(Liste!W7=\"\",\"\",ROUND(W$4/Liste!W$5*Liste!W7,W$6)))","v":""},{"$f":"IF(X$4=0,\"\",IF(Liste!X7=\"\",\"\",ROUND(X$4/Liste!X$5*Liste!X7,X$6)))","v":290},{"$f":"IF(Y$4=0,\"\",IF(Liste!Y7=\"\",\"\",ROUND(Y$4/Liste!Y$5*Liste!Y7,Y$6)))","v":""},{"$f":"IF(Z$4=0,\"\",IF(Liste!Z7=\"\",\"\",ROUND(Z$4/Liste!Z$5*Liste!Z7,Z$6)))","v":""},{"$f":"IF(AA$4=0,\"\",IF(Liste!AA7=\"\",\"\",ROUND(AA$4/Liste!AA$5*Liste!AA7,AA$6)))","v":""},{"$f":"IF(AB$4=0,\"\",IF(Liste!AB7=\"\",\"\",ROUND(AB$4/Liste!AB$5*Liste!AB7,AB$6)))","v":""},{"$f":"IF(AC$4=0,\"\",IF(Liste!AC7=\"\",\"\",ROUND(AC$4/Liste!AC$5*Liste!AC7,AC$6)))","v":""},{"$f":"IF(AD$4=0,\"\",IF(Liste!AD7=\"\",\"\",ROUND(AD$4/Liste!AD$5*Liste!AD7,AD$6)))","v":""},{"$f":"IF(AE$4=0,\"\",IF(Liste!AE7=\"\",\"\",ROUND(AE$4/Liste!AE$5*Liste!AE7,AE$6)))","v":""},{"$f":"IF(AF$4=0,\"\",IF(Liste!AF7=\"\",\"\",ROUND(AF$4/Liste!AF$5*Liste!AF7,AF$6)))","v":""},{"$f":"IF(AG$4=0,\"\",IF(Liste!AG7=\"\",\"\",ROUND(AG$4/Liste!AG$5*Liste!AG7,AG$6)))","v":""},{"$f":"IF(AH$4=0,\"\",IF(Liste!AH7=\"\",\"\",ROUND(AH$4/Liste!AH$5*Liste!AH7,AH$6)))","v":""}]
[{"$f":"IF(SUM($E8:$AH8)=0,\"\",SUM($E8:$AH8))","v":460},{"$f":"IF(Liste!B8=\"\",\"\",Liste!B8)","v":"Zucker"},{"$f":"IF(Liste!C8=\"\",\"\",Liste!C8)","v":""},{"$f":"IF(Liste!D8=\"\",\"\",Liste!D8)","v":"[g]"},{"$f":"IF(E$4=0,\"\",IF(Liste!E8=\"\",\"\",ROUND(E$4/Liste!E$5*Liste!E8,E$6)))","v":""},{"$f":"IF(F$4=0,\"\",IF(Liste!F8=\"\",\"\",ROUND(F$4/Liste!F$5*Liste!F8,F$6)))","v":""},{"$f":"IF(G$4=0,\"\",IF(Liste!G8=\"\",\"\",ROUND(G$4/Liste!G$5*Liste!G8,G$6)))","v":""},{"$f":"IF(H$4=0,\"\",IF(Liste!H8=\"\",\"\",ROUND(H$4/Liste!H$5*Liste!H8,H$6)))","v":""},{"$f":"IF(I$4=0,\"\",IF(Liste!I8=\"\",\"\",ROUND(I$4/Liste!I$5*Liste!I8,I$6)))","v":""},{"$f":"IF(J$4=0,\"\",IF(Liste!J8=\"\",\"\",ROUND(J$4/Liste!J$5*Liste!J8,J$6)))","v":""},{"$f":"IF(K$4=0,\"\",IF(Liste!K8=\"\",\"\",ROUND(K$4/Liste!K$5*Liste!K8,K$6)))","v":""},{"$f":"IF(L$4=0,\"\",IF(Liste!L8=\"\",\"\",ROUND(L$4/Liste!L$5*Liste!L8,L$6)))","v":100},{"$f":"IF(M$4=0,\"\",IF(Liste!M8=\"\",\"\",ROUND(M$4/Liste!M$5*Liste!M8,M$6)))","v":""},{"$f":"IF(N$4=0,\"\",IF(Liste!N8=\"\",\"\",ROUND(N$4/Liste!N$5*Liste!N8,N$6)))","v":""},{"$f":"IF(O$4=0,\"\",IF(Liste!O8=\"\",\"\",ROUND(O$4/Liste!O$5*Liste!O8,O$6)))","v":200},{"$f":"IF(P$4=0,\"\",IF(Liste!P8=\"\",\"\",ROUND(P$4/Liste!P$5*Liste!P8,P$6)))","v":""},{"$f":"IF(Q$4=0,\"\",IF(Liste!Q8=\"\",\"\",ROUND(Q$4/Liste!Q$5*Liste!Q8,Q$6)))","v":""},{"$f":"IF(R$4=0,\"\",IF(Liste!R8=\"\",\"\",ROUND(R$4/Liste!R$5*Liste!R8,R$6)))","v":""},{"$f":"IF(S$4=0,\"\",IF(Liste!S8=\"\",\"\",ROUND(S$4/Liste!S$5*Liste!S8,S$6)))","v":100},{"$f":"IF(T$4=0,\"\",IF(Liste!T8=\"\",\"\",ROUND(T$4/Liste!T$5*Liste!T8,T$6)))","v":""},{"$f":"IF(U$4=0,\"\",IF(Liste!U8=\"\",\"\",ROUND(U$4/Liste!U$5*Liste!U8,U$6)))","v":""},{"$f":"IF(V$4=0,\"\",IF(Liste!V8=\"\",\"\",ROUND(V$4/Liste!V$5*Liste!V8,V$6)))","v":60},{"$f":"IF(W$4=0,\"\",IF(Liste!W8=\"\",\"\",ROUND(W$4/Liste!W$5*Liste!W8,W$6)))","v":""},{"$f":"IF(X$4=0,\"\",IF(Liste!X8=\"\",\"\",ROUND(X$4/Liste!X$5*Liste!X8,X$6)))","v":""},{"$f":"IF(Y$4=0,\"\",IF(Liste!Y8=\"\",\"\",ROUND(Y$4/Liste!Y$5*Liste!Y8,Y$6)))","v":""},{"$f":"IF(Z$4=0,\"\",IF(Liste!Z8=\"\",\"\",ROUND(Z$4/Liste!Z$5*Liste!Z8,Z$6)))","v":""},{"$f":"IF(AA$4=0,\"\",IF(Liste!AA8=\"\",\"\",ROUND(AA$4/Liste!AA$5*Liste!AA8,AA$6)))","v":""},{"$f":"IF(AB$4=0,\"\",IF(Liste!AB8=\"\",\"\",ROUND(AB$4/Liste!AB$5*Liste!AB8,AB$6)))","v":""},{"$f":"IF(AC$4=0,\"\",IF(Liste!AC8=\"\",\"\",ROUND(AC$4/Liste!AC$5*Liste!AC8,AC$6)))","v":""},{"$f":"IF(AD$4=0,\"\",IF(Liste!AD8=\"\",\"\",ROUND(AD$4/Liste!AD$5*Liste!AD8,AD$6)))","v":""},{"$f":"IF(AE$4=0,\"\",IF(Liste!AE8=\"\",\"\",ROUND(AE$4/Liste!AE$5*Liste!AE8,AE$6)))","v":""},{"$f":"IF(AF$4=0,\"\",IF(Liste!AF8=\"\",\"\",ROUND(AF$4/Liste!AF$5*Liste!AF8,AF$6)))","v":""},{"$f":"IF(AG$4=0,\"\",IF(Liste!AG8=\"\",\"\",ROUND(AG$4/Liste!AG$5*Liste!AG8,AG$6)))","v":""},{"$f":"IF(AH$4=0,\"\",IF(Liste!AH8=\"\",\"\",ROUND(AH$4/Liste!AH$5*Liste!AH8,AH$6)))","v":""}]
[1195,{"$f":"IF(Liste!B9=\"\",\"\",Liste!B9)","v":"Butter"},{"$f":"IF(Liste!C9=\"\",\"\",Liste!C9)","v":""},{"$f":"IF(Liste!D9=\"\",\"\",Liste!D9)","v":"[g]"},{"$f":"IF(E$4=0,\"\",IF(Liste!E9=\"\",\"\",ROUND(E$4/Liste!E$5*Liste!E9,E$6)))","v":""},{"$f":"IF(F$4=0,\"\",IF(Liste!F9=\"\",\"\",ROUND(F$4/Liste!F$5*Liste!F9,F$6)))","v":300},{"$f":"IF(G$4=0,\"\",IF(Liste!G9=\"\",\"\",ROUND(G$4/Liste!G$5*Liste!G9,G$6)))","v":""},{"$f":"IF(H$4=0,\"\",IF(Liste!H9=\"\",\"\",ROUND(H$4/Liste!H$5*Liste!H9,H$6)))","v":""},{"$f":"IF(I$4=0,\"\",IF(Liste!I9=\"\",\"\",ROUND(I$4/Liste!I$5*Liste!I9,I$6)))","v":""},{"$f":"IF(J$4=0,\"\",IF(Liste!J9=\"\",\"\",ROUND(J$4/Liste!J$5*Liste!J9,J$6)))","v":""},{"$f":"IF(K$4=0,\"\",IF(Liste!K9=\"\",\"\",ROUND(K$4/Liste!K$5*Liste!K9,K$6)))","v":150},{"$f":"IF(L$4=0,\"\",IF(Liste!L9=\"\",\"\",ROUND(L$4/Liste!L$5*Liste!L9,L$6)))","v":125},{"$f":"IF(M$4=0,\"\",IF(Liste!M9=\"\",\"\",ROUND(M$4/Liste!M$5*Liste!M9,M$6)))","v":""},{"$f":"IF(N$4=0,\"\",IF(Liste!N9=\"\",\"\",ROUND(N$4/Liste!N$5*Liste!N9,N$6)))","v":""},{"$f":"IF(O$4=0,\"\",IF(Liste!O9=\"\",\"\",ROUND(O$4/Liste!O$5*Liste!O9,O$6)))","v":200},{"$f":"IF(P$4=0,\"\",IF(Liste!P9=\"\",\"\",ROUND(P$4/Liste!P$5*Liste!P9,P$6)))","v":20},{"$f":"IF(Q$4=0,\"\",IF(Liste!Q9=\"\",\"\",ROUND(Q$4/Liste!Q$5*Liste!Q9,Q$6)))","v":""},{"$f":"IF(R$4=0,\"\",IF(Liste!R9=\"\",\"\",ROUND(R$4/Liste!R$5*Liste!R9,R$6)))","v":""},{"$f":"IF(S$4=0,\"\",IF(Liste!S9=\"\",\"\",ROUND(S$4/Liste!S$5*Liste!S9,S$6)))","v":250},{"$f":"IF(T$4=0,\"\",IF(Liste!T9=\"\",\"\",ROUND(T$4/Liste!T$5*Liste!T9,T$6)))","v":""},{"$f":"IF(U$4=0,\"\",IF(Liste!U9=\"\",\"\",ROUND(U$4/Liste!U$5*Liste!U9,U$6)))","v":""},{"$f":"IF(V$4=0,\"\",IF(Liste!V9=\"\",\"\",ROUND(V$4/Liste!V$5*Liste!V9,V$6)))","v":""},{"$f":"IF(W$4=0,\"\",IF(Liste!W9=\"\",\"\",ROUND(W$4/Liste!W$5*Liste!W9,W$6)))","v":""},{"$f":"IF(X$4=0,\"\",IF(Liste!X9=\"\",\"\",ROUND(X$4/Liste!X$5*Liste!X9,X$6)))","v":150},{"$f":"IF(Y$4=0,\"\",IF(Liste!Y9=\"\",\"\",ROUND(Y$4/Liste!Y$5*Liste!Y9,Y$6)))","v":""},{"$f":"IF(Z$4=0,\"\",IF(Liste!Z9=\"\",\"\",ROUND(Z$4/Liste!Z$5*Liste!Z9,Z$6)))","v":""},{"$f":"IF(AA$4=0,\"\",IF(Liste!AA9=\"\",\"\",ROUND(AA$4/Liste!AA$5*Liste!AA9,AA$6)))","v":""},{"$f":"IF(AB$4=0,\"\",IF(Liste!AB9=\"\",\"\",ROUND(AB$4/Liste!AB$5*Liste!AB9,AB$6)))","v":""},{"$f":"IF(AC$4=0,\"\",IF(Liste!AC9=\"\",\"\",ROUND(AC$4/Liste!AC$5*Liste!AC9,AC$6)))","v":""},{"$f":"IF(AD$4=0,\"\",IF(Liste!AD9=\"\",\"\",ROUND(AD$4/Liste!AD$5*Liste!AD9,AD$6)))","v":""},{"$f":"IF(AE$4=0,\"\",IF(Liste!AE9=\"\",\"\",ROUND(AE$4/Liste!AE$5*Liste!AE9,AE$6)))","v":""},{"$f":"IF(AF$4=0,\"\",IF(Liste!AF9=\"\",\"\",ROUND(AF$4/Liste!AF$5*Liste!AF9,AF$6)))","v":""},{"$f":"IF(AG$4=0,\"\",IF(Liste!AG9=\"\",\"\",ROUND(AG$4/Liste!AG$5*Liste!AG9,AG$6)))","v":""},{"$f":"IF(AH$4=0,\"\",IF(Liste!AH9=\"\",\"\",ROUND(AH$4/Liste!AH$5*Liste!AH9,AH$6)))","v":""}]
[200,{"$f":"IF(Liste!B10=\"\",\"\",Liste!B10)","v":"Mandeln"},{"$f":"IF(Liste!C10=\"\",\"\",Liste!C10)","v":"gerieben"},{"$f":"IF(Liste!D10=\"\",\"\",Liste!D10)","v":"[g]"},{"$f":"IF(E$4=0,\"\",IF(Liste!E10=\"\",\"\",ROUND(E$4/Liste!E$5*Liste!E10,E$6)))","v":""},{"$f":"IF(F$4=0,\"\",IF(Liste!F10=\"\",\"\",ROUND(F$4/Liste!F$5*Liste!F10,F$6)))","v":""},{"$f":"IF(G$4=0,\"\",IF(Liste!G10=\"\",\"\",ROUND(G$4/Liste!G$5*Liste!G10,G$6)))","v":""},{"$f":"IF(H$4=0,\"\",IF(Liste!H10=\"\",\"\",ROUND(H$4/Liste!H$5*Liste!H10,H$6)))","v":""},{"$f":"IF(I$4=0,\"\",IF(Liste!I10=\"\",\"\",ROUND(I$4/Liste!I$5*Liste!I10,I$6)))","v":""},{"$f":"IF(J$4=0,\"\",IF(Liste!J10=\"\",\"\",ROUND(J$4/Liste!J$5*Liste!J10,J$6)))","v":""},{"$f":"IF(K$4=0,\"\",IF(Liste!K10=\"\",\"\",ROUND(K$4/Liste!K$5*Liste!K10,K$6)))","v":""},{"$f":"IF(L$4=0,\"\",IF(Liste!L10=\"\",\"\",ROUND(L$4/Liste!L$5*Liste!L10,L$6)))","v":""},{"$f":"IF(M$4=0,\"\",IF(Liste!M10=\"\",\"\",ROUND(M$4/Liste!M$5*Liste!M10,M$6)))","v":""},{"$f":"IF(N$4=0,\"\",IF(Liste!N10=\"\",\"\",ROUND(N$4/Liste!N$5*Liste!N10,N$6)))","v":""},{"$f":"IF(O$4=0,\"\",IF(Liste!O10=\"\",\"\",ROUND(O$4/Liste!O$5*Liste!O10,O$6)))","v":""},{"$f":"IF(P$4=0,\"\",IF(Liste!P10=\"\",\"\",ROUND(P$4/Liste!P$5*Liste!P10,P$6)))","v":200},{"$f":"IF(Q$4=0,\"\",IF(Liste!Q10=\"\",\"\",ROUND(Q$4/Liste!Q$5*Liste!Q10,Q$6)))","v":""},{"$f":"IF(R$4=0,\"\",IF(Liste!R10=\"\",\"\",ROUND(R$4/Liste!R$5*Liste!R10,R$6)))","v":""},{"$f":"IF(S$4=0,\"\",IF(Liste!S10=\"\",\"\",ROUND(S$4/Liste!S$5*Liste!S10,S$6)))","v":""},{"$f":"IF(T$4=0,\"\",IF(Liste!T10=\"\",\"\",ROUND(T$4/Liste!T$5*Liste!T10,T$6)))","v":""},{"$f":"IF(U$4=0,\"\",IF(Liste!U10=\"\",\"\",ROUND(U$4/Liste!U$5*Liste!U10,U$6)))","v":""},{"$f":"IF(V$4=0,\"\",IF(Liste!V10=\"\",\"\",ROUND(V$4/Liste!V$5*Liste!V10,V$6)))","v":""},{"$f":"IF(W$4=0,\"\",IF(Liste!W10=\"\",\"\",ROUND(W$4/Liste!W$5*Liste!W10,W$6)))","v":""},{"$f":"IF(X$4=0,\"\",IF(Liste!X10=\"\",\"\",ROUND(X$4/Liste!X$5*Liste!X10,X$6)))","v":""},{"$f":"IF(Y$4=0,\"\",IF(Liste!Y10=\"\",\"\",ROUND(Y$4/Liste!Y$5*Liste!Y10,Y$6)))","v":""},{"$f":"IF(Z$4=0,\"\",IF(Liste!Z10=\"\",\"\",ROUND(Z$4/Liste!Z$5*Liste!Z10,Z$6)))","v":""},{"$f":"IF(AA$4=0,\"\",IF(Liste!AA10=\"\",\"\",ROUND(AA$4/Liste!AA$5*Liste!AA10,AA$6)))","v":""},{"$f":"IF(AB$4=0,\"\",IF(Liste!AB10=\"\",\"\",ROUND(AB$4/Liste!AB$5*Liste!AB10,AB$6)))","v":""},{"$f":"IF(AC$4=0,\"\",IF(Liste!AC10=\"\",\"\",ROUND(AC$4/Liste!AC$5*Liste!AC10,AC$6)))","v":""},{"$f":"IF(AD$4=0,\"\",IF(Liste!AD10=\"\",\"\",ROUND(AD$4/Liste!AD$5*Liste!AD10,AD$6)))","v":""},{"$f":"IF(AE$4=0,\"\",IF(Liste!AE10=\"\",\"\",ROUND(AE$4/Liste!AE$5*Liste!AE10,AE$6)))","v":""},{"$f":"IF(AF$4=0,\"\",IF(Liste!AF10=\"\",\"\",ROUND(AF$4/Liste!AF$5*Liste!AF10,AF$6)))","v":""},{"$f":"IF(AG$4=0,\"\",IF(Liste!AG10=\"\",\"\",ROUND(AG$4/Liste!AG$5*Liste!AG10,AG$6)))","v":""},{"$f":"IF(AH$4=0,\"\",IF(Liste!AH10=\"\",\"\",ROUND(AH$4/Liste!AH$5*Liste!AH10,AH$6)))","v":""}]
{"$rows_left_out":291}
{"sheet":"Version","index":5,"n_rows":4,"n_cols":4,"rows_kept":4,"cut":false,"hidden":false,"merged":[[0,0,0,3]]}
["Bearbeitungen"]
["Version","Veränderung","Bemerkungen","Datum"]
["2.0","Deckblatt eingefügt",null,"2014-11-22"]
["2.01","Rezepte hinzugefügt",null,"2015-10-30"]

{"sheet":"11","index":6,"n_rows":57,"n_cols":8,"rows_kept":57,"cut":false,"hidden":false,"merged":[[32,2,32,7],[33,2,33,7],[34,2,34,7],[35,2,35,7],[2,4,2,7],[26,2,26,7],[27,2,27,7],[28,2,28,7],[30,2,30,7],[31,2,31,7]]}
[null,null,"zurück zur Auswahl"]
[]
[null,null,null,{"$f":"MID(CELL(\"dateiname\",A1),FIND(\"]\",CELL(\"dateiname\",A1))+1,255)","v":"11"},"Mandelplätzchen"]
[]
[null,null,null,null,"Zutaten für etwa 35 Stück:",null,null,"(Angabe in Gramm)"]
[]
[null,null,null,null,350,"g","Mehl"]
[null,null,null,null,1,"TL","Backpulver"]
[null,null,null,null,200,"g","Zucker"]
[null,null,null,null,150,"g","Speisestärke"]
{"$rows_left_out":48}
{"sheet":"12","index":7,"n_rows":57,"n_cols":8,"rows_kept":57,"cut":false,"hidden":false,"merged":[[32,2,32,7],[33,2,33,7],[34,2,34,7],[35,2,35,7],[2,4,2,7],[26,2,26,7],[27,2,27,7],[28,2,28,7],[30,2,30,7],[31,2,31,7]]}
[null,null,"zurück zur Auswahl"]
[]
[null,null,null,{"$f":"MID(CELL(\"dateiname\",A1),FIND(\"]\",CELL(\"dateiname\",A1))+1,255)","v":"12"},"Trüffelmakronen"]
[]
[null,null,null,null,"Zutaten für etwa 30 Stück:",null,null,"(Angabe in Gramm)"]
[]
[null,null,null,null,4,"St.","Eiweiß"]
[null,null,null,null,2,"TL","Zitronensaft"]
[null,null,null,null,250,"g","Puderzucker"]
[null,null,null,null,200,"g","gemahlene Mandeln"]
{"$rows_left_out":48}
{"sheet":"14","index":8,"n_rows":57,"n_cols":8,"rows_kept":57,"cut":false,"hidden":false,"merged":[[32,2,32,7],[33,2,33,7],[34,2,34,7],[35,2,35,7],[2,4,2,7],[26,2,26,7],[27,2,27,7],[28,2,28,7],[30,2,30,7],[31,2,31,7]]}
[null,null,"zurück zur Auswahl"]
[]
[null,null,null,{"$f":"MID(CELL(\"dateiname\",A1),FIND(\"]\",CELL(\"dateiname\",A1))+1,255)","v":"14"},"Kokos-Kipferln"]
[]
[null,null,null,null,"Zutaten für etwa 50 Stück:",null,null,"(Angabe in Gramm)"]
[]
[null,null,null,null,225,"g","Mehl"]
[null,null,null,null,75,"g","Puderzucker"]
[null,null,null,null,200,"g","Zucker"]
[null,null,null,null,60,"g","Kokosraspeln"]
{"$rows_left_out":48}
{"sheet":"17","index":9,"n_rows":57,"n_cols":8,"rows_kept":57,"cut":false,"hidden":false,"merged":[[32,2,32,7],[33,2,33,7],[34,2,34,7],[35,2,35,7],[2,4,2,7],[26,2,26,7],[27,2,27,7],[28,2,28,7],[30,2,30,7],[31,2,31,7]]}
[null,null,"zurück zur Auswahl"]
[]
[null,null,null,{"$f":"MID(CELL(\"dateiname\",A1),FIND(\"]\",CELL(\"dateiname\",A1))+1,255)","v":"17"},"Pistazienschnitten"]
[]
[null,null,null,null,"Zutaten für etwa 50 Stück:",null,null,"(Angabe in Gramm)"]
[]
[null,null,null,null,250,"g","Mehl"]
[null,null,null,null,2,"TL","Zimt"]
[null,null,null,null,1,"Pr.","Salz"]
[null,null,null,null,130,"g","Puderzucker"]
{"$rows_left_out":48}
{"sheet":"20","index":10,"n_rows":57,"n_cols":8,"rows_kept":57,"cut":false,"hidden":false,"merged":[[32,2,32,7],[33,2,33,7],[34,2,34,7],[35,2,35,7],[2,4,2,7],[26,2,26,7],[27,2,27,7],[28,2,28,7],[31,2,31,7],[30,2,30,7]]}
[null,null,"zurück zur Auswahl"]
[]
[null,null,null,{"$f":"MID(CELL(\"dateiname\",A1),FIND(\"]\",CELL(\"dateiname\",A1))+1,255)","v":"20"},"Marmorhappen"]
[]
[null,null,null,null,"Zutaten für etwa 40 Stück:",null,null,"(Angabe in Gramm)"]
[]
[null,null,null,null,290,"g","Mehl"]
[null,null,null,null,1,"TL","Backpulver"]
[null,null,null,null,125,"g","Puderzucker"]
[null,null,null,null,1,"Pr","Salz"]
{"$rows_left_out":48}
{"sheet":"Maßtabellen","index":11,"n_rows":2,"n_cols":3,"rows_kept":2,"cut":false,"hidden":false,"merged":[]}
[null,"TL","EL"]
["Kakopulver",3,10]