{"text_format":"1","workbook":"xlsx","n_sheets":12,"sheets":["DB","Auswahl","Einkauf","Liste","ZWtab","Version","11","12","14","17","20","Maßtabellen"],"not_rendered":{"charts":0,"images":6,"macros":1,"external_links":0,"defined_names":7,"comments":1,"pivot_tables":0},"unopened":[],"bounds":{"document_bytes":16777216,"sheet_cells":100000,"rows_first":2000,"rows_last":500,"rows_between":2000,"halvings":0,"cell_chars":16384,"cell_head_chars":4096},"cells_cut":0,"cells_raw":0,"read":"whole","date_system":"1900"}

{"sheet":"DB","index":0,"n_rows":36,"n_cols":9,"rows_kept":36,"cut":false,"hidden":false,"merged":[[4,1,4,8],[5,1,5,8]]}
[]
[]
[]
[]
[null,"Rezeptsammlung "]
[null,"Weihnachtsplätzchen"]
[]
[null,null,null,null,null,null,{"$f":"COUNTA(Auswahl!$B$3:$B$32)-COUNTBLANK(Auswahl!$B$3:$B$32)&\" Plätzchenrezepte enthalten\"","v":"20 Plätzchenrezepte enthalten"}]
[]
[]
[null,null,"Version",null,{"$f":"INDEX(Version!$A$3:$A$88,DCOUNTA(Version!$A$3:$A$88,1,Version!$A$3:$A$88)+1,0)","v":"2.01"}]
[]
[null,null,"Bearbeitungsstand:",null,{"$f":"MAX(Version!D3:D88)","v":"2015-10-30"}]
[]
[null,null,"Funktionen:",null,"- Mengenauswahl der Plätzchen"]
[null,null,null,null,"- Erstellen ener Einkaufsliste"]
[]
[null,null,"Arbeitsblätter:",null,"Auswahl","Auswahl der Plätzchen mit Mengenangabe"]
[null,null,null,null,"Einkauf","Einkaufsliste"]
[null,null,null,null,"Liste","Rezeptliste"]
[null,null,null,null,"Zwtab","Zwischentabelle"]
[null,null,null,null,"1-…","Auflistung einzelner Rezepte"]
[]
[null,null,null,null,"Version","Übersicht der Änderungen bzw. Erweiterungen"]
[]
[]
[null,null,null,null,"Es sind noch nicht alle auswählbaren Rezepte als Anleitung aufgenommen. Ich hoffe ich schaffe"]
[null,null,null,null,"es bis zum 06.12.2015."]
[]
[]
[]
[]
[null,null,null,null,null,null,null,null,{"$f":"\"© Patek, 2006-\"&YEAR(E13)","v":"© Patek, 2006-2015"}]
[]
[]
[null,"letzte Neuerung:",null,null,{"$f":"ROW(Version!A3:A88)","v":3}]

{"sheet":"Auswahl","index":1,"n_rows":32,"n_cols":7,"rows_kept":32,"cut":false,"hidden":false,"merged":[[0,1,0,2]]}
[null,"Rezept",null,"Auswahl"]
[null,null,"[St.]","[St.]","Ko.","Rezept","Quelle"]
[1,{"$f":"IF(INDEX(Liste!$E$3:$CF$3,A3)=0,\"\",INDEX(Liste!$E$3:$CF$3,A3))","v":"Wiener Vanillekipfel"},{"$f":"IF(INDEX(Liste!$E$5:$CF$5,A3)=0,\"\",INDEX(Liste!$E$5:$CF$5,A3))","v":80},null,{"$f":"IF(C3=0,\"\",IF(OR(D3/C3-INT(D3/C3)=0,D3/C3-INT(D3/C3)=0.5),\"\",\"Fehler\"))","v":""}]
[2,{"$f":"IF(INDEX(Liste!$E$3:$CF$3,A4)=0,\"\",INDEX(Liste!$E$3:$CF$3,A4))","v":"Schwarzweißgebäck"},{"$f":"IF(INDEX(Liste!$E$5:$CF$5,A4)=0,\"\",INDEX(Liste!$E$5:$CF$5,A4))","v":80},80,{"$f":"IF(C4=0,\"\",IF(OR(D4/C4-INT(D4/C4)=0,D4/C4-INT(D4/C4)=0.5),\"\",\"Fehler\"))","v":""}]
[3,{"$f":"IF(INDEX(Liste!$E$3:$CF$3,A5)=0,\"\",INDEX(Liste!$E$3:$CF$3,A5))","v":"Brune Kager"},{"$f":"IF(INDEX(Liste!$E$5:$CF$5,A5)=0,\"\",INDEX(Liste!$E$5:$CF$5,A5))","v":100},null,""]
[4,{"$f":"IF(INDEX(Liste!$E$3:$CF$3,A6)=0,\"\",INDEX(Liste!$E$3:$CF$3,A6))","v":"Italienische Pangani"},{"$f":"IF(INDEX(Liste!$E$5:$CF$5,A6)=0,\"\",INDEX(Liste!$E$5:$CF$5,A6))","v":80},null,""]
[5,{"$f":"IF(INDEX(Liste!$E$3:$CF$3,A7)=0,\"\",INDEX(Liste!$E$3:$CF$3,A7))","v":"Marillenringe"},{"$f":"IF(INDEX(Liste!$E$5:$CF$5,A7)=0,0,INDEX(Liste!$E$5:$CF$5,A7))","v":50},null,""]
[6,{"$f":"IF(INDEX(Liste!$E$3:$CF$3,A8)=0,\"\",INDEX(Liste!$E$3:$CF$3,A8))","v":"Elisenlebkuchen"},{"$f":"IF(INDEX(Liste!$E$5:$CF$5,A8)=0,0,INDEX(Liste!$E$5:$CF$5,A8))","v":42},null,""]
[7,{"$f":"IF(INDEX(Liste!$E$3:$CF$3,A9)=0,\"\",INDEX(Liste!$E$3:$CF$3,A9))","v":"Nusshäufchen"},{"$f":"IF(INDEX(Liste!$E$5:$CF$5,A9)=0,0,INDEX(Liste!$E$5:$CF$5,A9))","v":25},25,""]
[8,{"$f":"IF(INDEX(Liste!$E$3:$CF$3,A10)=0,\"\",INDEX(Liste!$E$3:$CF$3,A10))","v":"Marzipanstangen"},{"$f":"IF(INDEX(Liste!$E$5:$CF$5,A10)=0,0,INDEX(Liste!$E$5:$CF$5,A10))","v":50},50,""]
[9,{"$f":"IF(INDEX(Liste!$E$3:$CF$3,A11)=0,\"\",INDEX(Liste!$E$3:$CF$3,A11))","v":"Walnußbusserl"},{"$f":"IF(INDEX(Liste!$E$5:$CF$5,A11)=0,0,INDEX(Liste!$E$5:$CF$5,A11))","v":45},null,""]
[10,{"$f":"IF(INDEX(Liste!$E$3:$CF$3,A12)=0,\"\",INDEX(Liste!$E$3:$CF$3,A12))","v":"Kokosspiralen"},{"$f":"IF(INDEX(Liste!$E$5:$CF$5,A12)=0,0,INDEX(Liste!$E$5:$CF$5,A12))","v":40},null,""]
[11,{"$f":"IF(INDEX(Liste!$E$3:$CF$3,A13)=0,\"\",INDEX(Liste!$E$3:$CF$3,A13))","v":"Mandelplätzchen"},{"$f":"IF(INDEX(Liste!$E$5:$CF$5,A13)=0,0,INDEX(Liste!$E$5:$CF$5,A13))","v":35},35,"","M",{"$f":"MID('11'!$H$57,8,100)","v":" LISA Kochen & Backen 11/2009"}]
[12,{"$f":"IF(INDEX(Liste!$E$3:$CF$3,A14)=0,\"\",INDEX(Liste!$E$3:$CF$3,A14))","v":"Trüffelmakronen"},{"$f":"IF(INDEX(Liste!$E$5:$CF$5,A14)=0,0,INDEX(Liste!$E$5:$CF$5,A14))","v":30},30,"","M",{"$f":"MID('12'!$H$57,8,100)","v":" LISA Kochen & Backen 12/2007"}]
[13,{"$f":"IF(INDEX(Liste!$E$3:$CF$3,A15)=0,\"\",INDEX(Liste!$E$3:$CF$3,A15))","v":"Orangen-Schoko-Plätzchen"},{"$f":"IF(INDEX(Liste!$E$5:$CF$5,A15)=0,0,INDEX(Liste!$E$5:$CF$5,A15))","v":40},null,""]
[14,{"$f":"IF(INDEX(Liste!$E$3:$CF$3,A16)=0,\"\",INDEX(Liste!$E$3:$CF$3,A16))","v":"Kokos-Kipferln"},{"$f":"IF(INDEX(Liste!$E$5:$CF$5,A16)=0,0,INDEX(Liste!$E$5:$CF$5,A16))","v":50},null,"","M",{"$f":"MID('14'!$H$57,8,100)","v":" LISA Kochen & Backen Spezial/2012"}]
[15,{"$f":"IF(INDEX(Liste!$E$3:$CF$3,A17)=0,\"\",INDEX(Liste!$E$3:$CF$3,A17))","v":"Nusskipferln"},{"$f":"IF(INDEX(Liste!$E$5:$CF$5,A17)=0,0,INDEX(Liste!$E$5:$CF$5,A17))","v":60},60,{"$f":"IF(C17=0,\"\",IF(OR(D17/C17-INT(D17/C17)=0,D17/C17-INT(D17/C17)=0.5),\"\",\"Fehler\"))","v":""}]
[16,{"$f":"IF(INDEX(Liste!$E$3:$CF$3,A18)=0,\"\",INDEX(Liste!$E$3:$CF$3,A18))","v":"Heidesand mit Meersalz"},{"$f":"IF(INDEX(Liste!$E$5:$CF$5,A18)=0,0,INDEX(Liste!$E$5:$CF$5,A18))","v":100},null,""]
[17,{"$f":"IF(INDEX(Liste!$E$3:$CF$3,A19)=0,\"\",INDEX(Liste!$E$3:$CF$3,A19))","v":"Pistazienschnitten"},{"$f":"IF(INDEX(Liste!$E$5:$CF$5,A19)=0,0,INDEX(Liste!$E$5:$CF$5,A19))","v":50},null,"","M",{"$f":"MID('17'!$H$57,8,100)","v":" LISA Kochen & Backen 11/2009"}]
[18,{"$f":"IF(INDEX(Liste!$E$3:$CF$3,A20)=0,\"\",INDEX(Liste!$E$3:$CF$3,A20))","v":"Marmeladenplätzchen"},{"$f":"IF(INDEX(Liste!$E$5:$CF$5,A20)=0,0,INDEX(Liste!$E$5:$CF$5,A20))","v":30},30,""]
[19,{"$f":"IF(INDEX(Liste!$E$3:$CF$3,A21)=0,\"\",INDEX(Liste!$E$3:$CF$3,A21))","v":"Grazer Mandelrauten"},{"$f":"IF(INDEX(Liste!$E$5:$CF$5,A21)=0,0,INDEX(Liste!$E$5:$CF$5,A21))","v":50},null,""]
[20,{"$f":"IF(INDEX(Liste!$E$3:$CF$3,A22)=0,\"\",INDEX(Liste!$E$3:$CF$3,A22))","v":"Marmorhappen"},{"$f":"IF(INDEX(Liste!$E$5:$CF$5,A22)=0,0,INDEX(Liste!$E$5:$CF$5,A22))","v":40},40,"","M",{"$f":"MID('20'!$H$57,8,100)","v":" LISA Kochen & Backen 11/2010"}]
[21,{"$f":"IF(INDEX(Liste!$E$3:$CF$3,A23)=0,\"\",INDEX(Liste!$E$3:$CF$3,A23))","v":""},{"$f":"IF(INDEX(Liste!$E$5:$CF$5,A23)=0,0,INDEX(Liste!$E$5:$CF$5,A23))","v":0},null,""]
[22,{"$f":"IF(INDEX(Liste!$E$3:$CF$3,A24)=0,\"\",INDEX(Liste!$E$3:$CF$3,A24))","v":""},{"$f":"IF(INDEX(Liste!$E$5:$CF$5,A24)=0,0,INDEX(Liste!$E$5:$CF$5,A24))","v":0},null,""]
[23,{"$f":"IF(INDEX(Liste!$E$3:$CF$3,A25)=0,\"\",INDEX(Liste!$E$3:$CF$3,A25))","v":""},{"$f":"IF(INDEX(Liste!$E$5:$CF$5,A25)=0,0,INDEX(Liste!$E$5:$CF$5,A25))","v":0},null,""]
[24,{"$f":"IF(INDEX(Liste!$E$3:$CF$3,A26)=0,\"\",INDEX(Liste!$E$3:$CF$3,A26))","v":""},{"$f":"IF(INDEX(Liste!$E$5:$CF$5,A26)=0,0,INDEX(Liste!$E$5:$CF$5,A26))","v":0},null,""]
[25,{"$f":"IF(INDEX(Liste!$E$3:$CF$3,A27)=0,\"\",INDEX(Liste!$E$3:$CF$3,A27))","v":""},{"$f":"IF(INDEX(Liste!$E$5:$CF$5,A27)=0,0,INDEX(Liste!$E$5:$CF$5,A27))","v":0},null,""]
[26,{"$f":"IF(INDEX(Liste!$E$3:$CF$3,A28)=0,\"\",INDEX(Liste!$E$3:$CF$3,A28))","v":""},{"$f":"IF(INDEX(Liste!$E$5:$CF$5,A28)=0,0,INDEX(Liste!$E$5:$CF$5,A28))","v":0},null,""]
[27,{"$f":"IF(INDEX(Liste!$E$3:$CF$3,A29)=0,\"\",INDEX(Liste!$E$3:$CF$3,A29))","v":""},{"$f":"IF(INDEX(Liste!$E$5:$CF$5,A29)=0,0,INDEX(Liste!$E$5:$CF$5,A29))","v":0},null,""]
[28,{"$f":"IF(INDEX(Liste!$E$3:$CF$3,A30)=0,\"\",INDEX(Liste!$E$3:$CF$3,A30))","v":""},{"$f":"IF(INDEX(Liste!$E$5:$CF$5,A30)=0,0,INDEX(Liste!$E$5:$CF$5,A30))","v":0},null,""]
[29,{"$f":"IF(INDEX(Liste!$E$3:$CF$3,A31)=0,\"\",INDEX(Liste!$E$3:$CF$3,A31))","v":""},{"$f":"IF(INDEX(Liste!$E$5:$CF$5,A31)=0,0,INDEX(Liste!$E$5:$CF$5,A31))","v":0},null,""]
[30,{"$f":"IF(INDEX(Liste!$E$3:$CF$3,A32)=0,\"\",INDEX(Liste!$E$3:$CF$3,A32))","v":""},{"$f":"IF(INDEX(Liste!$E$5:$CF$5,A32)=0,0,INDEX(Liste!$E$5:$CF$5,A32))","v":0},null,""]

{"sheet":"Einkauf","index":2,"n_rows":64,"n_cols":11,"rows_kept":64,"cut":false,"hidden":false,"merged":[[1,1,1,10],[4,7,4,10],[5,9,5,10]]}
[]
[null,"Einkaufsliste"]
[]
[]
[null,null,{"$f":"IF(Auswahl!D3=0,\"\",INDEX(Auswahl!$B$3:$B$32,MATCH(Auswahl!A3,Auswahl!$A$3:$A$32),0))","v":""},null,{"$f":"IF(C5=\"\",\"\",INDEX(Auswahl!$D$3:$D$32,MATCH(Auswahl!A3,Auswahl!$A$3:$A$32),0))","v":""},{"$f":"IF(C5=\"\",\"\",\"[St.]\")","v":""},null,"Zutaten"]
[null,null,{"$f":"IF(Auswahl!D4=0,\"\",INDEX(Auswahl!$B$3:$B$32,MATCH(Auswahl!A4,Auswahl!$A$3:$A$32),0))","v":"Schwarzweißgebäck"},null,{"$f":"IF(C6=\"\",\"\",INDEX(Auswahl!$D$3:$D$32,MATCH(Auswahl!A4,Auswahl!$A$3:$A$32),0))","v":80},{"$f":"IF(C6=\"\",\"\",\"[St.]\")","v":"[St.]"},null,"Zutaten","Zusatz","Menge"]
[null,null,{"$f":"IF(Auswahl!D5=0,\"\",INDEX(Auswahl!$B$3:$B$32,MATCH(Auswahl!A5,Auswahl!$A$3:$A$32),0))","v":""},null,{"$f":"IF(C7=\"\",\"\",INDEX(Auswahl!$D$3:$D$32,MATCH(Auswahl!A5,Auswahl!$A$3:$A$32),0))","v":""},{"$f":"IF(C7=\"\",\"\",\"[St.]\")","v":""},null,{"$f":"ZWtab!B7","v":"Mehl"},{"$f":"ZWtab!C7","v":""},{"$f":"IF(ZWtab!A7=0,\"\",ZWtab!A7)","v":1735},{"$f":"ZWtab!D7","v":"[g]"}]
[null,null,{"$f":"IF(Auswahl!D6=0,\"\",INDEX(Auswahl!$B$3:$B$32,MATCH(Auswahl!A6,Auswahl!$A$3:$A$32),0))","v":""},null,{"$f":"IF(C8=\"\",\"\",INDEX(Auswahl!$D$3:$D$32,MATCH(Auswahl!A6,Auswahl!$A$3:$A$32),0))","v":""},"",null,{"$f":"ZWtab!B8","v":"Zucker"},{"$f":"ZWtab!C8","v":""},{"$f":"IF(ZWtab!A8=0,\"\",ZWtab!A8)","v":460},{"$f":"ZWtab!D8","v":"[g]"}]
[null,null,{"$f":"IF(Auswahl!D7=0,\"\",INDEX(Auswahl!$B$3:$B$32,MATCH(Auswahl!A7,Auswahl!$A$3:$A$32),0))","v":""},null,{"$f":"IF(C9=\"\",\"\",INDEX(Auswahl!$D$3:$D$32,MATCH(Auswahl!A7,Auswahl!$A$3:$A$32),0))","v":""},"",null,{"$f":"ZWtab!B9","v":"Butter"},{"$f":"ZWtab!C9","v":""},{"$f":"IF(ZWtab!A9=0,\"\",ZWtab!A9)","v":1195},{"$f":"ZWtab!D9","v":"[g]"}]
[null,null,{"$f":"IF(Auswahl!D8=0,\"\",INDEX(Auswahl!$B$3:$B$32,MATCH(Auswahl!A8,Auswahl!$A$3:$A$32),0))","v":""},null,{"$f":"IF(C10=\"\",\"\",INDEX(Auswahl!$D$3:$D$32,MATCH(Auswahl!A8,Auswahl!$A$3:$A$32),0))","v":""},"",null,{"$f":"ZWtab!B10","v":"Mandeln"},{"$f":"ZWtab!C10","v":"gerieben"},{"$f":"IF(ZWtab!A10=0,\"\",ZWtab!A10)","v":200},{"$f":"ZWtab!D10","v":"[g]"}]
[null,null,{"$f":"IF(Auswahl!D9=0,\"\",INDEX(Auswahl!$B$3:$B$32,MATCH(Auswahl!A9,Auswahl!$A$3:$A$32),0))","v":"Nusshäufchen"},null,{"$f":"IF(C11=\"\",\"\",INDEX(Auswahl!$D$3:$D$32,MATCH(Auswahl!A9,Auswahl!$A$3:$A$32),0))","v":25},"[St.]",null,{"$f":"ZWtab!B11","v":"Mandeln"},{"$f":"ZWtab!C11","v":"gehackt"},{"$f":"IF(ZWtab!A11=0,\"\",ZWtab!A11)","v":""},{"$f":"ZWtab!D11","v":"[g]"}]
[null,null,{"$f":"IF(Auswahl!D10=0,\"\",INDEX(Auswahl!$B$3:$B$32,MATCH(Auswahl!A10,Auswahl!$A$3:$A$32),0))","v":"Marzipanstangen"},null,{"$f":"IF(C12=\"\",\"\",INDEX(Auswahl!$D$3:$D$32,MATCH(Auswahl!A10,Auswahl!$A$3:$A$32),0))","v":50},"[St.]",null,{"$f":"ZWtab!B12","v":"Mandeln"},{"$f":"ZWtab!C12","v":"gehobelt"},{"$f":"IF(ZWtab!A12=0,\"\",ZWtab!A12)","v":100},{"$f":"ZWtab!D12","v":"[g]"}]
[null,null,{"$f":"IF(Auswahl!D11=0,\"\",INDEX(Auswahl!$B$3:$B$32,MATCH(Auswahl!A11,Auswahl!$A$3:$A$32),0))","v":""},null,{"$f":"IF(C13=\"\",\"\",INDEX(Auswahl!$D$3:$D$32,MATCH(Auswahl!A11,Auswahl!$A$3:$A$32),0))","v":""},"",null,{"$f":"ZWtab!B13","v":"Mandelblättchen"},{"$f":"ZWtab!C13","v":""},{"$f":"IF(ZWtab!A13=0,\"\",ZWtab!A13)","v":60},{"$f":"ZWtab!D13","v":"[St.]"}]
[null,null,{"$f":"IF(Auswahl!D12=0,\"\",INDEX(Auswahl!$B$3:$B$32,MATCH(Auswahl!A12,Auswahl!$A$3:$A$32),0))","v":""},null,{"$f":"IF(C14=\"\",\"\",INDEX(Auswahl!$D$3:$D$32,MATCH(Auswahl!A12,Auswahl!$A$3:$A$32),0))","v":""},"",null,{"$f":"ZWtab!B14","v":"Haselnüsse"},{"$f":"ZWtab!C14","v":""},{"$f":"IF(ZWtab!A14=0,\"\",ZWtab!A14)","v":""},{"$f":"ZWtab!D14","v":"[g]"}]
[null,null,{"$f":"IF(Auswahl!D13=0,\"\",INDEX(Auswahl!$B$3:$B$32,MATCH(Auswahl!A13,Auswahl!$A$3:$A$32),0))","v":"Mandelplätzchen"},null,{"$f":"IF(C15=\"\",\"\",INDEX(Auswahl!$D$3:$D$32,MATCH(Auswahl!A13,Auswahl!$A$3:$A$32),0))","v":35},"[St.]",null,{"$f":"ZWtab!B15","v":"Haselnüsse"},{"$f":"ZWtab!C15","v":"gehackt"},{"$f":"IF(ZWtab!A15=0,\"\",ZWtab!A15)","v":""},{"$f":"ZWtab!D15","v":"[g]"}]
[null,null,{"$f":"IF(Auswahl!D14=0,\"\",INDEX(Auswahl!$B$3:$B$32,MATCH(Auswahl!A14,Auswahl!$A$3:$A$32),0))","v":"Trüffelmakronen"},null,{"$f":"IF(C16=\"\",\"\",INDEX(Auswahl!$D$3:$D$32,MATCH(Auswahl!A14,Auswahl!$A$3:$A$32),0))","v":30},"[St.]",null,{"$f":"ZWtab!B16","v":"Kokosraspel"},{"$f":"ZWtab!C16","v":""},{"$f":"IF(ZWtab!A16=0,\"\",ZWtab!A16)","v":125},{"$f":"ZWtab!D16","v":"[g]"}]
[null,null,{"$f":"IF(Auswahl!D15=0,\"\",INDEX(Auswahl!$B$3:$B$32,MATCH(Auswahl!A15,Auswahl!$A$3:$A$32),0))","v":""},null,{"$f":"IF(C17=\"\",\"\",INDEX(Auswahl!$D$3:$D$32,MATCH(Auswahl!A15,Auswahl!$A$3:$A$32),0))","v":""},"",null,{"$f":"ZWtab!B17","v":"Pistazien"},{"$f":"ZWtab!C17","v":"gehackt"},{"$f":"IF(ZWtab!A17=0,\"\",ZWtab!A17)","v":""},{"$f":"ZWtab!D17","v":"[g]"}]
[null,null,{"$f":"IF(Auswahl!D16=0,\"\",INDEX(Auswahl!$B$3:$B$32,MATCH(Auswahl!A16,Auswahl!$A$3:$A$32),0))","v":""},null,{"$f":"IF(C18=\"\",\"\",INDEX(Auswahl!$D$3:$D$32,MATCH(Auswahl!A16,Auswahl!$A$3:$A$32),0))","v":""},"",null,{"$f":"ZWtab!B18","v":"Walnüsse"},{"$f":"ZWtab!C18","v":"gemahlen"},{"$f":"IF(ZWtab!A18=0,\"\",ZWtab!A18)","v":200},{"$f":"ZWtab!D18","v":"[g]"}]
[null,null,{"$f":"IF(Auswahl!D17=0,\"\",INDEX(Auswahl!$B$3:$B$32,MATCH(Auswahl!A17,Auswahl!$A$3:$A$32),0))","v":"Nusskipferln"},null,{"$f":"IF(C19=\"\",\"\",INDEX(Auswahl!$D$3:$D$32,MATCH(Auswahl!A17,Auswahl!$A$3:$A$32),0))","v":60},"[St.]",null,{"$f":"ZWtab!B19","v":"Marzipanrohmasse"},{"$f":"ZWtab!C19","v":""},{"$f":"IF(ZWtab!A19=0,\"\",ZWtab!A19)","v":300},{"$f":"ZWtab!D19","v":"[g]"}]
[null,null,{"$f":"IF(Auswahl!D18=0,\"\",INDEX(Auswahl!$B$3:$B$32,MATCH(Auswahl!A18,Auswahl!$A$3:$A$32),0))","v":""},null,{"$f":"IF(C20=\"\",\"\",INDEX(Auswahl!$D$3:$D$32,MATCH(Auswahl!A18,Auswahl!$A$3:$A$32),0))","v":""},"",null,{"$f":"ZWtab!B20","v":"Kakaopulver"},{"$f":"ZWtab!C20","v":""},{"$f":"IF(ZWtab!A20=0,\"\",ZWtab!A20)","v":100},{"$f":"ZWtab!D20","v":"[g]"}]
[null,null,{"$f":"IF(Auswahl!D19=0,\"\",INDEX(Auswahl!$B$3:$B$32,MATCH(Auswahl!A19,Auswahl!$A$3:$A$32),0))","v":""},null,{"$f":"IF(C21=\"\",\"\",INDEX(Auswahl!$D$3:$D$32,MATCH(Auswahl!A19,Auswahl!$A$3:$A$32),0))","v":""},"",null,{"$f":"ZWtab!B21","v":"Speisestärke"},{"$f":"ZWtab!C21","v":""},{"$f":"IF(ZWtab!A21=0,\"\",ZWtab!A21)","v":150},{"$f":"ZWtab!D21","v":"[g]"}]
[null,null,{"$f":"IF(Auswahl!D20=0,\"\",INDEX(Auswahl!$B$3:$B$32,MATCH(Auswahl!A20,Auswahl!$A$3:$A$32),0))","v":"Marmeladenplätzchen"},null,{"$f":"IF(C22=\"\",\"\",INDEX(Auswahl!$D$3:$D$32,MATCH(Auswahl!A20,Auswahl!$A$3:$A$32),0))","v":30},"[St.]",null,{"$f":"ZWtab!B22","v":"Ahornsirup"},{"$f":"ZWtab!C22","v":""},{"$f":"IF(ZWtab!A22=0,\"\",ZWtab!A22)","v":""},{"$f":"ZWtab!D22","v":"[g]"}]
[null,null,{"$f":"IF(Auswahl!D21=0,\"\",INDEX(Auswahl!$B$3:$B$32,MATCH(Auswahl!A21,Auswahl!$A$3:$A$32),0))","v":""},null,{"$f":"IF(C23=\"\",\"\",INDEX(Auswahl!$D$3:$D$32,MATCH(Auswahl!A21,Auswahl!$A$3:$A$32),0))","v":""},"",null,{"$f":"ZWtab!B23","v":"Zitronat"},{"$f":"ZWtab!C23","v":"gehackt"},{"$f":"IF(ZWtab!A23=0,\"\",ZWtab!A23)","v":""},{"$f":"ZWtab!D23","v":"[g]"}]
[null,null,{"$f":"IF(Auswahl!D22=0,\"\",INDEX(Auswahl!$B$3:$B$32,MATCH(Auswahl!A22,Auswahl!$A$3:$A$32),0))","v":"Marmorhappen"},null,{"$f":"IF(C24=\"\",\"\",INDEX(Auswahl!$D$3:$D$32,MATCH(Auswahl!A22,Auswahl!$A$3:$A$32),0))","v":40},"[St.]",null,{"$f":"ZWtab!B24","v":"Pottasche"},{"$f":"ZWtab!C24","v":""},{"$f":"IF(ZWtab!A24=0,\"\",ZWtab!A24)","v":""},{"$f":"ZWtab!D24","v":"[g]"}]
[null,null,{"$f":"IF(Auswahl!D23=0,\"\",INDEX(Auswahl!$B$3:$B$32,MATCH(Auswahl!A23,Auswahl!$A$3:$A$32),0))","v":""},null,{"$f":"IF(C25=\"\",\"\",INDEX(Auswahl!$D$3:$D$32,MATCH(Auswahl!A23,Auswahl!$A$3:$A$32),0))","v":""},"",null,{"$f":"ZWtab!B25","v":"Blockschokolade"},{"$f":"ZWtab!C25","v":""},{"$f":"IF(ZWtab!A25=0,\"\",ZWtab!A25)","v":150},{"$f":"ZWtab!D25","v":"[g]"}]
[null,null,{"$f":"IF(Auswahl!D24=0,\"\",INDEX(Auswahl!$B$3:$B$32,MATCH(Auswahl!A24,Auswahl!$A$3:$A$32),0))","v":""},null,{"$f":"IF(C26=\"\",\"\",INDEX(Auswahl!$D$3:$D$32,MATCH(Auswahl!A24,Auswahl!$A$3:$A$32),0))","v":""},"",null,{"$f":"ZWtab!B26","v":"Marmelade"},{"$f":"ZWtab!C26","v":""},{"$f":"IF(ZWtab!A26=0,\"\",ZWtab!A26)","v":125},{"$f":"ZWtab!D26","v":"[g]"}]
[null,null,{"$f":"IF(Auswahl!D25=0,\"\",INDEX(Auswahl!$B$3:$B$32,MATCH(Auswahl!A25,Auswahl!$A$3:$A$32),0))","v":""},null,{"$f":"IF(C27=\"\",\"\",INDEX(Auswahl!$D$3:$D$32,MATCH(Auswahl!A25,Auswahl!$A$3:$A$32),0))","v":""},"",null,{"$f":"ZWtab!B27","v":"Nüsse"},{"$f":"ZWtab!C27","v":"gerieben"},{"$f":"IF(ZWtab!A27=0,\"\",ZWtab!A27)","v":""},{"$f":"ZWtab!D27","v":"[g]"}]
[null,null,{"$f":"IF(Auswahl!D26=0,\"\",INDEX(Auswahl!$B$3:$B$32,MATCH(Auswahl!A26,Auswahl!$A$3:$A$32),0))","v":""},null,{"$f":"IF(C28=\"\",\"\",INDEX(Auswahl!$D$3:$D$32,MATCH(Auswahl!A26,Auswahl!$A$3:$A$32),0))","v":""},"",null,{"$f":"ZWtab!B28","v":"Orangeat"},{"$f":"ZWtab!C28","v":"gehackt"},{"$f":"IF(ZWtab!A28=0,\"\",ZWtab!A28)","v":""},{"$f":"ZWtab!D28","v":"[g]"}]
[null,null,{"$f":"IF(Auswahl!D27=0,\"\",INDEX(Auswahl!$B$3:$B$32,MATCH(Auswahl!A27,Auswahl!$A$3:$A$32),0))","v":""},null,{"$f":"IF(C29=\"\",\"\",INDEX(Auswahl!$D$3:$D$32,MATCH(Auswahl!A27,Auswahl!$A$3:$A$32),0))","v":""},"",null,{"$f":"ZWtab!B29","v":"Kurvertüre"},{"$f":"ZWtab!C29","v":""},{"$f":"IF(ZWtab!A29=0,\"\",ZWtab!A29)","v":330},{"$f":"ZWtab!D29","v":"[g]"}]
[null,null,{"$f":"IF(Auswahl!D28=0,\"\",INDEX(Auswahl!$B$3:$B$32,MATCH(Auswahl!A28,Auswahl!$A$3:$A$32),0))","v":""},null,{"$f":"IF(C30=\"\",\"\",INDEX(Auswahl!$D$3:$D$32,MATCH(Auswahl!A28,Auswahl!$A$3:$A$32),0))","v":""},"",null,{"$f":"ZWtab!B30","v":"Haselnusmus"},{"$f":"ZWtab!C30","v":""},{"$f":"IF(ZWtab!A30=0,\"\",ZWtab!A30)","v":200},{"$f":"ZWtab!D30","v":"[g]"}]
[null,null,{"$f":"IF(Auswahl!D29=0,\"\",INDEX(Auswahl!$B$3:$B$32,MATCH(Auswahl!A29,Auswahl!$A$3:$A$32),0))","v":""},null,{"$f":"IF(C31=\"\",\"\",INDEX(Auswahl!$D$3:$D$32,MATCH(Auswahl!A29,Auswahl!$A$3:$A$32),0))","v":""},"",null,{"$f":"ZWtab!B31","v":"Sucanat"},{"$f":"ZWtab!C31","v":""},{"$f":"IF(ZWtab!A31=0,\"\",ZWtab!A31)","v":150},{"$f":"ZWtab!D31","v":"[g]"}]
[null,null,{"$f":"IF(A32=\"\",\"\",INDEX(Auswahl!$B$3:$B$32,MATCH($A32,Auswahl!$A$3:$A$32),0))","v":""},null,{"$f":"IF(C32=\"\",\"\",INDEX(Auswahl!$D$3:$D$32,MATCH(Auswahl!A30,Auswahl!$A$3:$A$32),0))","v":""},"",null,{"$f":"ZWtab!B32","v":"Dopppelrahmfrischkäse"},{"$f":"ZWtab!C32","v":""},{"$f":"IF(ZWtab!A32=0,\"\",ZWtab!A32)","v":""},{"$f":"ZWtab!D32","v":"[g]"}]
[null,null,null,null,null,null,null,{"$f":"ZWtab!B33","v":""},{"$f":"ZWtab!C33","v":""},{"$f":"IF(ZWtab!A33=0,\"\",ZWtab!A33)","v":""},{"$f":"ZWtab!D33","v":""}]
[null,null,null,null,null,null,null,{"$f":"ZWtab!B34","v":"Eigelb"},{"$f":"ZWtab!C34","v":""},{"$f":"IF(ZWtab!A34=0,\"\",ZWtab!A34)","v":7},{"$f":"ZWtab!D34","v":"[St.]"}]
[null,null,null,null,null,null,null,{"$f":"ZWtab!B35","v":"Eiweiß"},{"$f":"ZWtab!C35","v":""},{"$f":"IF(ZWtab!A35=0,\"\",ZWtab!A35)","v":14},{"$f":"ZWtab!D35","v":"[St.]"}]
[null,null,null,null,null,null,null,{"$f":"ZWtab!B36","v":"Zitrone"},{"$f":"ZWtab!C36","v":""},{"$f":"IF(ZWtab!A36=0,\"\",ZWtab!A36)","v":1},{"$f":"ZWtab!D36","v":"[St.]"}]
[null,null,null,null,null,null,null,{"$f":"ZWtab!B37","v":"abgeriebene Schale Zitrone"},{"$f":"ZWtab!C37","v":""},{"$f":"IF(ZWtab!A37=0,\"\",ZWtab!A37)","v":1},{"$f":"ZWtab!D37","v":"[St.]"}]
[null,null,null,null,null,null,null,{"$f":"ZWtab!B38","v":"abgeriebene Schale Orange"},{"$f":"ZWtab!C38","v":""},{"$f":"IF(ZWtab!A38=0,\"\",ZWtab!A38)","v":""},{"$f":"ZWtab!D38","v":"[St.]"}]
[null,null,null,null,null,null,null,{"$f":"ZWtab!B39","v":"Vanillieschoten"},{"$f":"ZWtab!C39","v":""},{"$f":"IF(ZWtab!A39=0,\"\",ZWtab!A39)","v":""},{"$f":"ZWtab!D39","v":"[St.]"}]
[null,null,null,null,null,null,null,{"$f":"ZWtab!B40","v":"Backoblaten"},{"$f":"ZWtab!C40","v":"d = 5 cm"},{"$f":"IF(ZWtab!A40=0,\"\",ZWtab!A40)","v":""},{"$f":"ZWtab!D40","v":"[St.]"}]
[null,null,null,null,null,null,null,{"$f":"ZWtab!B41","v":""},{"$f":"ZWtab!C41","v":""},{"$f":"IF(ZWtab!A41=0,\"\",ZWtab!A41)","v":""},{"$f":"ZWtab!D41","v":""}]
[null,null,null,null,null,null,null,{"$f":"ZWtab!B42","v":"Vanilliezucker"},{"$f":"ZWtab!C42","v":""},{"$f":"IF(ZWtab!A42=0,\"\",ZWtab!A42)","v":1},{"$f":"ZWtab!D42","v":"[Pck.]"}]
[null,null,null,null,null,null,null,{"$f":"ZWtab!B43","v":""},{"$f":"ZWtab!C43","v":""},{"$f":"IF(ZWtab!A43=0,\"\",ZWtab!A43)","v":""},{"$f":"ZWtab!D43","v":""}]
[null,null,null,null,null,null,null,{"$f":"ZWtab!B44","v":"Puderzucker"},{"$f":"ZWtab!C44","v":""},{"$f":"IF(ZWtab!A44=0,\"\",ZWtab!A44)","v":""},{"$f":"ZWtab!D44","v":"[Tasse]"}]
[null,null,null,null,null,null,null,{"$f":"ZWtab!B45","v":"Puderzucker"},{"$f":"ZWtab!C45","v":""},{"$f":"IF(ZWtab!A45=0,\"\",ZWtab!A45)","v":475},{"$f":"ZWtab!D45","v":"[g]"}]
[null,null,null,null,null,null,null,{"$f":"ZWtab!B46","v":""},{"$f":"ZWtab!C46","v":""},{"$f":"IF(ZWtab!A46=0,\"\",ZWtab!A46)","v":""},{"$f":"ZWtab!D46","v":""}]
[null,null,null,null,null,null,null,{"$f":"ZWtab!B47","v":"Gewürznelken"},{"$f":"ZWtab!C47","v":"gemahlen"},{"$f":"IF(ZWtab!A47=0,\"\",ZWtab!A47)","v":""},{"$f":"ZWtab!D47","v":"[Tl.]"}]
[null,null,null,null,null,null,null,{"$f":"ZWtab!B48","v":"Zimt"},{"$f":"ZWtab!C48","v":"gemahlen"},{"$f":"IF(ZWtab!A48=0,\"\",ZWtab!A48)","v":""},{"$f":"ZWtab!D48","v":"[Tl.]"}]
[null,null,null,null,null,null,null,{"$f":"ZWtab!B49","v":"Ingverpulver"},{"$f":"ZWtab!C49","v":""},{"$f":"IF(ZWtab!A49=0,\"\",ZWtab!A49)","v":""},{"$f":"ZWtab!D49","v":"[Tl.]"}]
[null,null,null,null,null,null,null,{"$f":"ZWtab!B50","v":"Kardamon"},{"$f":"ZWtab!C50","v":""},{"$f":"IF(ZWtab!A50=0,\"\",ZWtab!A50)","v":""},{"$f":"ZWtab!D50","v":"[Tl.]"}]
[null,null,null,null,null,null,null,{"$f":"ZWtab!B51","v":"Backpulver"},{"$f":"ZWtab!C51","v":""},{"$f":"IF(ZWtab!A51=0,\"\",ZWtab!A51)","v":4},{"$f":"ZWtab!D51","v":"[Tl.]"}]
[null,null,null,null,null,null,null,{"$f":"ZWtab!B52","v":"Milch"},{"$f":"ZWtab!C52","v":""},{"$f":"IF(ZWtab!A52=0,\"\",ZWtab!A52)","v":""},{"$f":"ZWtab!D52","v":"[Eßl.]"}]
[null,null,null,null,null,null,null,{"$f":"ZWtab!B53","v":"Sahne"},{"$f":"ZWtab!C53","v":"(1 Eß = 15 ml = 10 g)"},{"$f":"IF(ZWtab!A53=0,\"\",ZWtab!A53)","v":100},{"$f":"ZWtab!D53","v":"[g]"}]
[null,null,null,null,null,null,null,{"$f":"ZWtab!B54","v":"Salz"},{"$f":"ZWtab!C54","v":""},{"$f":"IF(ZWtab!A54=0,\"\",ZWtab!A54)","v":3},{"$f":"ZWtab!D54","v":"[Pr.]"}]
[null,null,null,null,null,null,null,{"$f":"ZWtab!B55","v":"Rum"},{"$f":"ZWtab!C55","v":"(Tl = 5 ml)"},{"$f":"IF(ZWtab!A55=0,\"\",ZWtab!A55)","v":""},{"$f":"ZWtab!D55","v":"[cl]"}]
[null,null,null,null,null,null,null,{"$f":"ZWtab!B56","v":"Hirschhornsalz"},{"$f":"ZWtab!C56","v":""},{"$f":"IF(ZWtab!A56=0,\"\",ZWtab!A56)","v":""},{"$f":"ZWtab!D56","v":"[g]"}]
[null,null,null,null,null,null,null,{"$f":"ZWtab!B57","v":"Muskat"},{"$f":"ZWtab!C57","v":""},{"$f":"IF(ZWtab!A57=0,\"\",ZWtab!A57)","v":""},{"$f":"ZWtab!D57","v":"[Tl.]"}]
[null,null,null,null,null,null,null,{"$f":"ZWtab!B58","v":"Macis"},{"$f":"ZWtab!C58","v":""},{"$f":"IF(ZWtab!A58=0,\"\",ZWtab!A58)","v":""},{"$f":"ZWtab!D58","v":"[Pr.]"}]
[null,null,null,null,null,null,null,{"$f":"ZWtab!B59","v":"Natron"},{"$f":"ZWtab!C59","v":""},{"$f":"IF(ZWtab!A59=0,\"\",ZWtab!A59)","v":""},{"$f":"ZWtab!D59","v":"[TL]"}]
[null,null,null,null,null,null,null,{"$f":"ZWtab!B60","v":"Buttermandelaroma"},{"$f":"ZWtab!C60","v":""},{"$f":"IF(ZWtab!A60=0,\"\",ZWtab!A60)","v":2},{"$f":"ZWtab!D60","v":"[Tr]"}]
[null,null,null,null,null,null,null,{"$f":"ZWtab!B61","v":""},{"$f":"ZWtab!C61","v":""},{"$f":"IF(ZWtab!A61=0,\"\",ZWtab!A61)","v":""},{"$f":"ZWtab!D61","v":""}]
[null,null,null,null,null,null,null,{"$f":"ZWtab!B62","v":""},{"$f":"ZWtab!C62","v":""},{"$f":"IF(ZWtab!A62=0,\"\",ZWtab!A62)","v":""},{"$f":"ZWtab!D62","v":""}]
[null,null,null,null,null,null,null,{"$f":"ZWtab!B63","v":""},{"$f":"ZWtab!C63","v":""},{"$f":"IF(ZWtab!A63=0,\"\",ZWtab!A63)","v":""},{"$f":"ZWtab!D63","v":""}]
[null,null,null,null,null,null,null,{"$f":"ZWtab!B64","v":""},{"$f":"ZWtab!C64","v":""},{"$f":"IF(ZWtab!A64=0,\"\",ZWtab!A64)","v":""},{"$f":"ZWtab!D64","v":""}]

{"sheet":"Liste","index":3,"n_rows":60,"n_cols":34,"rows_kept":60,"cut":false,"hidden":true,"merged":[]}
[null,null,null,{"$f":"MAX(E1:AH1)","v":15},{"$f":"COUNTIF(E$7:E$100,\">0\")","v":8},5,10,12,10,15,8,11,10,12,{"$f":"COUNTIF(O$7:O$100,\">0\")","v":9},{"$f":"COUNTIF(P$7:P$100,\">0\")","v":7},10,6,8,5,11,8,12,7,0,0,0,0,0,0,0,0,0,0]
[null,null,null,null,{"$f":"COLUMN(E3)-4","v":1},{"$f":"COLUMN(F3)-4","v":2},3,4,5,6,7,8,9,10,11,12,13,14,15,16,17,18,19,{"$f":"COLUMN(X3)-4","v":20},{"$f":"COLUMN(Y3)-4","v":21},{"$f":"COLUMN(Z3)-4","v":22},{"$f":"COLUMN(AA3)-4","v":23},{"$f":"COLUMN(AB3)-4","v":24},{"$f":"COLUMN(AC3)-4","v":25},{"$f":"COLUMN(AD3)-4","v":26},{"$f":"COLUMN(AE3)-4","v":27},{"$f":"COLUMN(AF3)-4","v":28},{"$f":"COLUMN(AG3)-4","v":29},{"$f":"COLUMN(AH3)-4","v":30}]
[null,"Zutaten","Zusatz","Mengen","Wiener Vanillekipfel","Schwarzweißgebäck","Brune Kager","Italienische Pangani","Marillenringe","Elisenlebkuchen","Nusshäufchen","Marzipanstangen","Walnußbusserl","Kokosspiralen","Mandelplätzchen","Trüffelmakronen","Orangen-Schoko-Plätzchen","Kokos-Kipferln","Nusskipferln","Heidesand mit Meersalz","Pistazienschnitten","Marmeladenplätzchen","Grazer Mandelrauten","Marmorhappen"]
[]
[null,null,null,"Stück",80,80,100,80,50,42,25,50,45,40,35,30,40,50,60,100,50,30,50,40]
[]
[null,"Mehl",null,"[g]",300,400,500,500,400,30,250,200,250,220,350,null,200,225,200,400,250,45,300,290]
[null,"Zucker",null,"[g]",100,null,200,300,120,150,null,100,70,120,200,null,100,null,100,210,null,60]
[null,"Butter",null,"[g]",200,300,250,200,250,null,150,125,125,150,200,20,125,200,250,250,100,null,225,150]
[null,"Mandeln","gerieben","[g]",50,null,null,9,null,150,null,null,null,null,null,200]
[null,"Mandeln","gehackt","[g]",null,null,75,null,null,null,null,null,null,null,null,null,null,null,null,null,null,null,60]
[null,"Mandeln","gehobelt","[g]",null,null,null,null,null,null,30,null,null,null,70]
[null,"Mandelblättchen",null,"[St.]",null,null,null,null,null,null,null,null,null,null,null,null,null,null,60]
[null,"Haselnüsse",null,"[g]",50]
[null,"Haselnüsse","gehackt","[g]",null,null,null,null,null,null,null,null,null,50]
[null,"Kokosraspel",null,"[g]",null,null,null,null,null,null,null,null,null,75,null,null,null,60,null,null,null,125]
[null,"Pistazien","gehackt","[g]",null,null,null,null,null,null,null,null,null,null,null,null,null,null,null,null,100]
[null,"Walnüsse","gemahlen","[g]",null,null,null,null,null,null,null,null,100,null,null,null,null,null,200]
[null,"Marzipanrohmasse",null,"[g]",null,null,null,null,null,100,null,200,null,null,null,null,null,null,null,null,450,100]
[null,"Kakaopulver",null,"[g]",null,40,null,null,null,null,null,null,null,25,null,30,null,null,null,null,null,null,null,30]
[null,"Speisestärke",null,"[g]",null,null,null,null,null,null,null,null,null,null,150,null,60]
[null,"Ahornsirup",null,"[g]",null,null,125]
[null,"Zitronat","gehackt","[g]",null,null,75]
[null,"Pottasche",null,"[g]",null,null,7]
[null,"Blockschokolade",null,"[g]",null,null,null,100,null,null,null,null,null,null,null,150,100]
[null,"Marmelade",null,"[g]",null,null,null,null,250,null,null,null,null,null,null,null,null,null,null,null,null,125]
[null,"Nüsse","gerieben","[g]",null,null,null,null,null,150]
[null,"Orangeat","gehackt","[g]",null,null,null,null,null,70]
[null,"Kurvertüre",null,"[g]",null,null,null,null,null,250,null,100,100,null,150,null,null,null,80,null,null,null,100]
[null,"Haselnusmus",null,"[g]",null,null,null,null,null,null,200]
[null,"Sucanat",null,"[g]",null,null,null,null,null,null,150]
[null,"Dopppelrahmfrischkäse",null,"[g]",null,null,null,null,null,null,null,null,null,100]
[]
[null,"Eigelb",null,"[St.]",2,null,null,1,1,null,2,2,1,1,2,null,1,null,null,null,1,null,1,1]
[null,"Eiweiß",null,"[St.]",null,2,null,1,null,4,2,2,1,1,2,4,1,null,null,null,1,2,1]
[null,"Zitrone",null,"[St.]",null,null,null,1,null,null,null,null,null,null,null,null,null,null,null,null,null,0.5]
[null,"abgeriebene Schale Zitrone",null,"[St.]",null,null,null,null,1,0.25,null,1,null,null,null,null,null,0.5,null,null,null,null,0.5]
[null,"abgeriebene Schale Orange",null,"[St.]",null,null,null,null,null,null,null,null,null,null,null,null,1]
[null,"Vanillieschoten",null,"[St.]",null,null,null,null,null,null,null,null,null,null,null,null,null,2]
[null,"Backoblaten","d = 5 cm","[St.]",null,null,null,null,null,42]
[]
[null,"Vanilliezucker",null,"[Pck.]",5,null,null,1,1,null,null,1,null,1,null,null,1,null,null,1,null,null,1]
[]
[null,"Puderzucker",null,"[Tasse]",0.5,null,null,null,0.5]
[null,"Puderzucker",null,"[g]",null,150,null,null,null,null,null,null,null,null,null,200,null,75,null,null,130,null,100,125]
[]
[null,"Gewürznelken","gemahlen","[Tl.]",null,null,0.5,null,null,0.5]
[null,"Zimt","gemahlen","[Tl.]",null,null,2,0.25,null,0.25,null,null,1,null,null,null,null,null,null,null,2]
[null,"Ingverpulver",null,"[Tl.]",null,null,0.5]
[null,"Kardamon",null,"[Tl.]",null,null,null,0.25,null,0.25]
[null,"Backpulver",null,"[Tl.]",null,null,null,null,null,null,1,1,1,null,1,null,1,null,null,null,null,null,null,1]
[null,"Milch",null,"[Eßl.]",null,null,null,3,null,null,null,null,null,1,null,null,null,null,null,null,null,null,5]
[null,"Sahne","(1 Eß = 15 ml = 10 g)","[g]",null,null,null,null,null,null,null,null,null,null,null,80,null,null,20,null,50,null,50]
[null,"Salz",null,"[Pr.]",null,null,null,null,1,null,null,1,null,null,null,null,null,null,null,1,1,1,1,1]
[null,"Rum","(Tl = 5 ml)","[cl]",null,null,null,null,2,null,null,null,null,null,null,null,null,null,null,null,1]
[null,"Hirschhornsalz",null,"[g]",null,null,null,null,null,5]
[null,"Muskat",null,"[Tl.]",null,null,null,null,null,0.25]
[null,"Macis",null,"[Pr.]",null,null,null,null,null,null,null,null,1]
[null,"Natron",null,"[TL]",null,null,null,null,null,null,null,null,null,0.5]
[null,"Buttermandelaroma",null,"[Tr]",null,null,null,null,null,null,null,null,null,null,null,null,null,null,2]

{"sheet":"ZWtab","index":4,"n_rows":300,"n_cols":34,"rows_kept":300,"cut":false,"hidden":true,"merged":[]}
[null,null,null,null,{"$f":"COLUMN(E2)-4","v":1},{"$f":"COLUMN(F2)-4","v":2},3,4,5,6,7,8,9,10,11,12,13,14,15,16,17,18,19,20,21,22,23,24,25,26,27,28,29,30]
[null,null,null,null,{"$f":"IF(Liste!E3=\"\",\"\",Liste!E3)","v":"Wiener Vanillekipfel"},{"$f":"IF(Liste!F3=\"\",\"\",Liste!F3)","v":"Schwarzweißgebäck"},{"$f":"IF(Liste!G3=\"\",\"\",Liste!G3)","v":"Brune Kager"},{"$f":"IF(Liste!H3=\"\",\"\",Liste!H3)","v":"Italienische Pangani"},{"$f":"IF(Liste!I3=\"\",\"\",Liste!I3)","v":"Marillenringe"},{"$f":"IF(Liste!J3=\"\",\"\",Liste!J3)","v":"Elisenlebkuchen"},{"$f":"IF(Liste!K3=\"\",\"\",Liste!K3)","v":"Nusshäufchen"},{"$f":"IF(Liste!L3=\"\",\"\",Liste!L3)","v":"Marzipanstangen"},{"$f":"IF(Liste!M3=\"\",\"\",Liste!M3)","v":"Walnußbusserl"},{"$f":"IF(Liste!N3=\"\",\"\",Liste!N3)","v":"Kokosspiralen"},{"$f":"IF(Liste!O3=\"\",\"\",Liste!O3)","v":"Mandelplätzchen"},{"$f":"IF(Liste!P3=\"\",\"\",Liste!P3)","v":"Trüffelmakronen"},{"$f":"IF(Liste!Q3=\"\",\"\",Liste!Q3)","v":"Orangen-Schoko-Plätzchen"},{"$f":"IF(Liste!R3=\"\",\"\",Liste!R3)","v":"Kokos-Kipferln"},{"$f":"IF(Liste!S3=\"\",\"\",Liste!S3)","v":"Nusskipferln"},{"$f":"IF(Liste!T3=\"\",\"\",Liste!T3)","v":"Heidesand mit Meersalz"},{"$f":"IF(Liste!U3=\"\",\"\",Liste!U3)","v":"Pistazienschnitten"},{"$f":"IF(Liste!V3=\"\",\"\",Liste!V3)","v":"Marmeladenplätzchen"},{"$f":"IF(Liste!W3=\"\",\"\",Liste!W3)","v":"Grazer Mandelrauten"},{"$f":"IF(Liste!X3=\"\",\"\",Liste!X3)","v":"Marmorhappen"},{"$f":"IF(Liste!Y3=\"\",\"\",Liste!Y3)","v":""},{"$f":"IF(Liste!Z3=\"\",\"\",Liste!Z3)","v":""},{"$f":"IF(Liste!AA3=\"\",\"\",Liste!AA3)","v":""},{"$f":"IF(Liste!AB3=\"\",\"\",Liste!AB3)","v":""},{"$f":"IF(Liste!AC3=\"\",\"\",Liste!AC3)","v":""},{"$f":"IF(Liste!AD3=\"\",\"\",Liste!AD3)","v":""},{"$f":"IF(Liste!AE3=\"\",\"\",Liste!AE3)","v":""},{"$f":"IF(Liste!AF3=\"\",\"\",Liste!AF3)","v":""},{"$f":"IF(Liste!AG3=\"\",\"\",Liste!AG3)","v":""},{"$f":"IF(Liste!AH3=\"\",\"\",Liste!AH3)","v":""}]
[]
["SUMME","Stück",null,null,{"$f":"IF(Auswahl!$D3=\"\",0,Auswahl!$D3)","v":0},{"$f":"IF(Auswahl!$D4=\"\",0,Auswahl!$D4)","v":80},{"$f":"IF(Auswahl!$D5=\"\",0,Auswahl!$D5)","v":0},{"$f":"IF(Auswahl!$D6=\"\",0,Auswahl!$D6)","v":0},{"$f":"IF(Auswahl!$D7=\"\",0,Auswahl!$D7)","v":0},{"$f":"IF(Auswahl!$D8=\"\",0,Auswahl!$D8)","v":0},{"$f":"IF(Auswahl!$D9=\"\",0,Auswahl!$D9)","v":25},{"$f":"IF(Auswahl!$D10=\"\",0,Auswahl!$D10)","v":50},{"$f":"IF(Auswahl!$D11=\"\",0,Auswahl!$D11)","v":0},{"$f":"IF(Auswahl!$D12=\"\",0,Auswahl!$D12)","v":0},{"$f":"IF(Auswahl!$D13=\"\",0,Auswahl!$D13)","v":35},{"$f":"IF(Auswahl!$D14=\"\",0,Auswahl!$D14)","v":30},{"$f":"IF(Auswahl!$D15=\"\",0,Auswahl!$D15)","v":0},{"$f":"IF(Auswahl!$D16=\"\",0,Auswahl!$D16)","v":0},{"$f":"IF(Auswahl!$D17=\"\",0,Auswahl!$D17)","v":60},{"$f":"IF(Auswahl!$D18=\"\",0,Auswahl!$D18)","v":0},{"$f":"IF(Auswahl!$D19=\"\",0,Auswahl!$D19)","v":0},{"$f":"IF(Auswahl!$D20=\"\",0,Auswahl!$D20)","v":30},{"$f":"IF(Auswahl!$D21=\"\",0,Auswahl!$D21)","v":0},{"$f":"IF(Auswahl!$D22=\"\",0,Auswahl!$D22)","v":40},{"$f":"IF(Auswahl!$D23=\"\",0,Auswahl!$D23)","v":0},{"$f":"IF(Auswahl!$D24=\"\",0,Auswahl!$D24)","v":0},{"$f":"IF(Auswahl!$D25=\"\",0,Auswahl!$D25)","v":0},{"$f":"IF(Auswahl!$D26=\"\",0,Auswahl!$D26)","v":0},{"$f":"IF(Auswahl!$D27=\"\",0,Auswahl!$D27)","v":0},{"$f":"IF(Auswahl!$D28=\"\",0,Auswahl!$D28)","v":0},{"$f":"IF(Auswahl!$D29=\"\",0,Auswahl!$D29)","v":0},{"$f":"IF(Auswahl!$D30=\"\",0,Auswahl!$D30)","v":0},{"$f":"IF(Auswahl!$D31=\"\",0,Auswahl!$D31)","v":0},{"$f":"IF(Auswahl!$D32=\"\",0,Auswahl!$D32)","v":0}]
[null,"Zutaten"]
[null,null,"Zusatz","Runden",0,0,0,0,0,0,0,0,0,0,0,0,0,0,0,0,0,0,0,0,0,0,0,0,0,0,0,0,0,0]
[{"$f":"IF(SUM($E7:$AH7)=0,\"\",SUM($E7:$AH7))","v":1735},{"$f":"IF(Liste!B7=\"\",\"\",Liste!B7)","v":"Mehl"},{"$f":"IF(Liste!C7=\"\",\"\",Liste!C7)","v":""},{"$f":"IF(Liste!D7=\"\",\"\",Liste!D7)","v":"[g]"},{"$f":"IF(E$4=0,\"\",IF(Liste!E7=\"\",\"\",ROUND(E$4/Liste!E$5*Liste!E7,E$6)))","v":""},{"$f":"IF(F$4=0,\"\",IF(Liste!F7=\"\",\"\",ROUND(F$4/Liste!F$5*Liste!F7,F$6)))","v":400},{"$f":"IF(G$4=0,\"\",IF(Liste!G7=\"\",\"\",ROUND(G$4/Liste!G$5*Liste!G7,G$6)))","v":""},{"$f":"IF(H$4=0,\"\",IF(Liste!H7=\"\",\"\",ROUND(H$4/Liste!H$5*Liste!H7,H$6)))","v":""},{"$f":"IF(I$4=0,\"\",IF(Liste!I7=\"\",\"\",ROUND(I$4/Liste!I$5*Liste!I7,I$6)))","v":""},{"$f":"IF(J$4=0,\"\",IF(Liste!J7=\"\",\"\",ROUND(J$4/Liste!J$5*Liste!J7,J$6)))","v":""},{"$f":"IF(K$4=0,\"\",IF(Liste!K7=\"\",\"\",ROUND(K$4/Liste!K$5*Liste!K7,K$6)))","v":250},{"$f":"IF(L$4=0,\"\",IF(Liste!L7=\"\",\"\",ROUND(L$4/Liste!L$5*Liste!L7,L$6)))","v":200},{"$f":"IF(M$4=0,\"\",IF(Liste!M7=\"\",\"\",ROUND(M$4/Liste!M$5*Liste!M7,M$6)))","v":""},{"$f":"IF(N$4=0,\"\",IF(Liste!N7=\"\",\"\",ROUND(N$4/Liste!N$5*Liste!N7,N$6)))","v":""},{"$f":"IF(O$4=0,\"\",IF(Liste!O7=\"\",\"\",ROUND(O$4/Liste!O$5*Liste!O7,O$6)))","v":350},{"$f":"IF(P$4=0,\"\",IF(Liste!P7=\"\",\"\",ROUND(P$4/Liste!P$5*Liste!P7,P$6)))","v":""},{"$f":"IF(Q$4=0,\"\",IF(Liste!Q7=\"\",\"\",ROUND(Q$4/Liste!Q$5*Liste!Q7,Q$6)))","v":""},{"$f":"IF(R$4=0,\"\",IF(Liste!R7=\"\",\"\",ROUND(R$4/Liste!R$5*Liste!R7,R$6)))","v":""},{"$f":"IF(S$4=0,\"\",IF(Liste!S7=\"\",\"\",ROUND(S$4/Liste!S$5*Liste!S7,S$6)))","v":200},{"$f":"IF(T$4=0,\"\",IF(Liste!T7=\"\",\"\",ROUND(T$4/Liste!T$5*Liste!T7,T$6)))","v":""},{"$f":"IF(U$4=0,\"\",IF(Liste!U7=\"\",\"\",ROUND(U$4/Liste!U$5*Liste!U7,U$6)))","v":""},{"$f":"IF(V$4=0,\"\",IF(Liste!V7=\"\",\"\",ROUND(V$4/Liste!V$5*Liste!V7,V$6)))","v":45},{"$f":"IF(W$4=0,\"\",IF(Liste!W7=\"\",\"\",ROUND(W$4/Liste!W$5*Liste!W7,W$6)))","v":""},{"$f":"IF(X$4=0,\"\",IF(Liste!X7=\"\",\"\",ROUND(X$4/Liste!X$5*Liste!X7,X$6)))","v":290},{"$f":"IF(Y$4=0,\"\",IF(Liste!Y7=\"\",\"\",ROUND(Y$4/Liste!Y$5*Liste!Y7,Y$6)))","v":""},{"$f":"IF(Z$4=0,\"\",IF(Liste!Z7=\"\",\"\",ROUND(Z$4/Liste!Z$5*Liste!Z7,Z$6)))","v":""},{"$f":"IF(AA$4=0,\"\",IF(Liste!AA7=\"\",\"\",ROUND(AA$4/Liste!AA$5*Liste!AA7,AA$6)))","v":""},{"$f":"IF(AB$4=0,\"\",IF(Liste!AB7=\"\",\"\",ROUND(AB$4/Liste!AB$5*Liste!AB7,AB$6)))","v":""},{"$f":"IF(AC$4=0,\"\",IF(Liste!AC7=\"\",\"\",ROUND(AC$4/Liste!AC$5*Liste!AC7,AC$6)))","v":""},{"$f":"IF(AD$4=0,\"\",IF(Liste!AD7=\"\",\"\",ROUND(AD$4/Liste!AD$5*Liste!AD7,AD$6)))","v":""},{"$f":"IF(AE$4=0,\"\",IF(Liste!AE7=\"\",\"\",ROUND(AE$4/Liste!AE$5*Liste!AE7,AE$6)))","v":""},{"$f":"IF(AF$4=0,\"\",IF(Liste!AF7=\"\",\"\",ROUND(AF$4/Liste!AF$5*Liste!AF7,AF$6)))","v":""},{"$f":"IF(AG$4=0,\"\",IF(Liste!AG7=\"\",\"\",ROUND(AG$4/Liste!AG$5*Liste!AG7,AG$6)))","v":""},{"$f":"IF(AH$4=0,\"\",IF(Liste!AH7=\"\",\"\",ROUND(AH$4/Liste!AH$5*Liste!AH7,AH$6)))","v":""}]
[{"$f":"IF(SUM($E8:$AH8)=0,\"\",SUM($E8:$AH8))","v":460},{"$f":"IF(Liste!B8=\"\",\"\",Liste!B8)","v":"Zucker"},{"$f":"IF(Liste!C8=\"\",\"\",Liste!C8)","v":""},{"$f":"IF(Liste!D8=\"\",\"\",Liste!D8)","v":"[g]"},{"$f":"IF(E$4=0,\"\",IF(Liste!E8=\"\",\"\",ROUND(E$4/Liste!E$5*Liste!E8,E$6)))","v":""},{"$f":"IF(F$4=0,\"\",IF(Liste!F8=\"\",\"\",ROUND(F$4/Liste!F$5*Liste!F8,F$6)))","v":""},{"$f":"IF(G$4=0,\"\",IF(Liste!G8=\"\",\"\",ROUND(G$4/Liste!G$5*Liste!G8,G$6)))","v":""},{"$f":"IF(H$4=0,\"\",IF(Liste!H8=\"\",\"\",ROUND(H$4/Liste!H$5*Liste!H8,H$6)))","v":""},{"$f":"IF(I$4=0,\"\",IF(Liste!I8=\"\",\"\",ROUND(I$4/Liste!I$5*Liste!I8,I$6)))","v":""},{"$f":"IF(J$4=0,\"\",IF(Liste!J8=\"\",\"\",ROUND(J$4/Liste!J$5*Liste!J8,J$6)))","v":""},{"$f":"IF(K$4=0,\"\",IF(Liste!K8=\"\",\"\",ROUND(K$4/Liste!K$5*Liste!K8,K$6)))","v":""},{"$f":"IF(L$4=0,\"\",IF(Liste!L8=\"\",\"\",ROUND(L$4/Liste!L$5*Liste!L8,L$6)))","v":100},{"$f":"IF(M$4=0,\"\",IF(Liste!M8=\"\",\"\",ROUND(M$4/Liste!M$5*Liste!M8,M$6)))","v":""},{"$f":"IF(N$4=0,\"\",IF(Liste!N8=\"\",\"\",ROUND(N$4/Liste!N$5*Liste!N8,N$6)))","v":""},{"$f":"IF(O$4=0,\"\",IF(Liste!O8=\"\",\"\",ROUND(O$4/Liste!O$5*Liste!O8,O$6)))","v":200},{"$f":"IF(P$4=0,\"\",IF(Liste!P8=\"\",\"\",ROUND(P$4/Liste!P$5*Liste!P8,P$6)))","v":""},{"$f":"IF(Q$4=0,\"\",IF(Liste!Q8=\"\",\"\",ROUND(Q$4/Liste!Q$5*Liste!Q8,Q$6)))","v":""},{"$f":"IF(R$4=0,\"\",IF(Liste!R8=\"\",\"\",ROUND(R$4/Liste!R$5*Liste!R8,R$6)))","v":""},{"$f":"IF(S$4=0,\"\",IF(Liste!S8=\"\",\"\",ROUND(S$4/Liste!S$5*Liste!S8,S$6)))","v":100},{"$f":"IF(T$4=0,\"\",IF(Liste!T8=\"\",\"\",ROUND(T$4/Liste!T$5*Liste!T8,T$6)))","v":""},{"$f":"IF(U$4=0,\"\",IF(Liste!U8=\"\",\"\",ROUND(U$4/Liste!U$5*Liste!U8,U$6)))","v":""},{"$f":"IF(V$4=0,\"\",IF(Liste!V8=\"\",\"\",ROUND(V$4/Liste!V$5*Liste!V8,V$6)))","v":60},{"$f":"IF(W$4=0,\"\",IF(Liste!W8=\"\",\"\",ROUND(W$4/Liste!W$5*Liste!W8,W$6)))","v":""},{"$f":"IF(X$4=0,\"\",IF(Liste!X8=\"\",\"\",ROUND(X$4/Liste!X$5*Liste!X8,X$6)))","v":""},{"$f":"IF(Y$4=0,\"\",IF(Liste!Y8=\"\",\"\",ROUND(Y$4/Liste!Y$5*Liste!Y8,Y$6)))","v":""},{"$f":"IF(Z$4=0,\"\",IF(Liste!Z8=\"\",\"\",ROUND(Z$4/Liste!Z$5*Liste!Z8,Z$6)))","v":""},{"$f":"IF(AA$4=0,\"\",IF(Liste!AA8=\"\",\"\",ROUND(AA$4/Liste!AA$5*Liste!AA8,AA$6)))","v":""},{"$f":"IF(AB$4=0,\"\",IF(Liste!AB8=\"\",\"\",ROUND(AB$4/Liste!AB$5*Liste!AB8,AB$6)))","v":""},{"$f":"IF(AC$4=0,\"\",IF(Liste!AC8=\"\",\"\",ROUND(AC$4/Liste!AC$5*Liste!AC8,AC$6)))","v":""},{"$f":"IF(AD$4=0,\"\",IF(Liste!AD8=\"\",\"\",ROUND(AD$4/Liste!AD$5*Liste!AD8,AD$6)))","v":""},{"$f":"IF(AE$4=0,\"\",IF(Liste!AE8=\"\",\"\",ROUND(AE$4/Liste!AE$5*Liste!AE8,AE$6)))","v":""},{"$f":"IF(AF$4=0,\"\",IF(Liste!AF8=\"\",\"\",ROUND(AF$4/Liste!AF$5*Liste!AF8,AF$6)))","v":""},{"$f":"IF(AG$4=0,\"\",IF(Liste!AG8=\"\",\"\",ROUND(AG$4/Liste!AG$5*Liste!AG8,AG$6)))","v":""},{"$f":"IF(AH$4=0,\"\",IF(Liste!AH8=\"\",\"\",ROUND(AH$4/Liste!AH$5*Liste!AH8,AH$6)))","v":""}]
[1195,{"$f":"IF(Liste!B9=\"\",\"\",Liste!B9)","v":"Butter"},{"$f":"IF(Liste!C9=\"\",\"\",Liste!C9)","v":""},{"$f":"IF(Liste!D9=\"\",\"\",Liste!D9)","v":"[g]"},{"$f":"IF(E$4=0,\"\",IF(Liste!E9=\"\",\"\",ROUND(E$4/Liste!E$5*Liste!E9,E$6)))","v":""},{"$f":"IF(F$4=0,\"\",IF(Liste!F9=\"\",\"\",ROUND(F$4/Liste!F$5*Liste!F9,F$6)))","v":300},{"$f":"IF(G$4=0,\"\",IF(Liste!G9=\"\",\"\",ROUND(G$4/Liste!G$5*Liste!G9,G$6)))","v":""},{"$f":"IF(H$4=0,\"\",IF(Liste!H9=\"\",\"\",ROUND(H$4/Liste!H$5*Liste!H9,H$6)))","v":""},{"$f":"IF(I$4=0,\"\",IF(Liste!I9=\"\",\"\",ROUND(I$4/Liste!I$5*Liste!I9,I$6)))","v":""},{"$f":"IF(J$4=0,\"\",IF(Liste!J9=\"\",\"\",ROUND(J$4/Liste!J$5*Liste!J9,J$6)))","v":""},{"$f":"IF(K$4=0,\"\",IF(Liste!K9=\"\",\"\",ROUND(K$4/Liste!K$5*Liste!K9,K$6)))","v":150},{"$f":"IF(L$4=0,\"\",IF(Liste!L9=\"\",\"\",ROUND(L$4/Liste!L$5*Liste!L9,L$6)))","v":125},{"$f":"IF(M$4=0,\"\",IF(Liste!M9=\"\",\"\",ROUND(M$4/Liste!M$5*Liste!M9,M$6)))","v":""},{"$f":"IF(N$4=0,\"\",IF(Liste!N9=\"\",\"\",ROUND(N$4/Liste!N$5*Liste!N9,N$6)))","v":""},{"$f":"IF(O$4=0,\"\",IF(Liste!O9=\"\",\"\",ROUND(O$4/Liste!O$5*Liste!O9,O$6)))","v":200},{"$f":"IF(P$4=0,\"\",IF(Liste!P9=\"\",\"\",ROUND(P$4/Liste!P$5*Liste!P9,P$6)))","v":20},{"$f":"IF(Q$4=0,\"\",IF(Liste!Q9=\"\",\"\",ROUND(Q$4/Liste!Q$5*Liste!Q9,Q$6)))","v":""},{"$f":"IF(R$4=0,\"\",IF(Liste!R9=\"\",\"\",ROUND(R$4/Liste!R$5*Liste!R9,R$6)))","v":""},{"$f":"IF(S$4=0,\"\",IF(Liste!S9=\"\",\"\",ROUND(S$4/Liste!S$5*Liste!S9,S$6)))","v":250},{"$f":"IF(T$4=0,\"\",IF(Liste!T9=\"\",\"\",ROUND(T$4/Liste!T$5*Liste!T9,T$6)))","v":""},{"$f":"IF(U$4=0,\"\",IF(Liste!U9=\"\",\"\",ROUND(U$4/Liste!U$5*Liste!U9,U$6)))","v":""},{"$f":"IF(V$4=0,\"\",IF(Liste!V9=\"\",\"\",ROUND(V$4/Liste!V$5*Liste!V9,V$6)))","v":""},{"$f":"IF(W$4=0,\"\",IF(Liste!W9=\"\",\"\",ROUND(W$4/Liste!W$5*Liste!W9,W$6)))","v":""},{"$f":"IF(X$4=0,\"\",IF(Liste!X9=\"\",\"\",ROUND(X$4/Liste!X$5*Liste!X9,X$6)))","v":150},{"$f":"IF(Y$4=0,\"\",IF(Liste!Y9=\"\",\"\",ROUND(Y$4/Liste!Y$5*Liste!Y9,Y$6)))","v":""},{"$f":"IF(Z$4=0,\"\",IF(Liste!Z9=\"\",\"\",ROUND(Z$4/Liste!Z$5*Liste!Z9,Z$6)))","v":""},{"$f":"IF(AA$4=0,\"\",IF(Liste!AA9=\"\",\"\",ROUND(AA$4/Liste!AA$5*Liste!AA9,AA$6)))","v":""},{"$f":"IF(AB$4=0,\"\",IF(Liste!AB9=\"\",\"\",ROUND(AB$4/Liste!AB$5*Liste!AB9,AB$6)))","v":""},{"$f":"IF(AC$4=0,\"\",IF(Liste!AC9=\"\",\"\",ROUND(AC$4/Liste!AC$5*Liste!AC9,AC$6)))","v":""},{"$f":"IF(AD$4=0,\"\",IF(Liste!AD9=\"\",\"\",ROUND(AD$4/Liste!AD$5*Liste!AD9,AD$6)))","v":""},{"$f":"IF(AE$4=0,\"\",IF(Liste!AE9=\"\",\"\",ROUND(AE$4/Liste!AE$5*Liste!AE9,AE$6)))","v":""},{"$f":"IF(AF$4=0,\"\",IF(Liste!AF9=\"\",\"\",ROUND(AF$4/Liste!AF$5*Liste!AF9,AF$6)))","v":""},{"$f":"IF(AG$4=0,\"\",IF(Liste!AG9=\"\",\"\",ROUND(AG$4/Liste!AG$5*Liste!AG9,AG$6)))","v":""},{"$f":"IF(AH$4=0,\"\",IF(Liste!AH9=\"\",\"\",ROUND(AH$4/Liste!AH$5*Liste!AH9,AH$6)))","v":""}]
[200,{"$f":"IF(Liste!B10=\"\",\"\",Liste!B10)","v":"Mandeln"},{"$f":"IF(Liste!C10=\"\",\"\",Liste!C10)","v":"gerieben"},{"$f":"IF(Liste!D10=\"\",\"\",Liste!D10)","v":"[g]"},{"$f":"IF(E$4=0,\"\",IF(Liste!E10=\"\",\"\",ROUND(E$4/Liste!E$5*Liste!E10,E$6)))","v":""},{"$f":"IF(F$4=0,\"\",IF(Liste!F10=\"\",\"\",ROUND(F$4/Liste!F$5*Liste!F10,F$6)))","v":""},{"$f":"IF(G$4=0,\"\",IF(Liste!G10=\"\",\"\",ROUND(G$4/Liste!G$5*Liste!G10,G$6)))","v":""},{"$f":"IF(H$4=0,\"\",IF(Liste!H10=\"\",\"\",ROUND(H$4/Liste!H$5*Liste!H10,H$6)))","v":""},{"$f":"IF(I$4=0,\"\",IF(Liste!I10=\"\",\"\",ROUND(I$4/Liste!I$5*Liste!I10,I$6)))","v":""},{"$f":"IF(J$4=0,\"\",IF(Liste!J10=\"\",\"\",ROUND(J$4/Liste!J$5*Liste!J10,J$6)))","v":""},{"$f":"IF(K$4=0,\"\",IF(Liste!K10=\"\",\"\",ROUND(K$4/Liste!K$5*Liste!K10,K$6)))","v":""},{"$f":"IF(L$4=0,\"\",IF(Liste!L10=\"\",\"\",ROUND(L$4/Liste!L$5*Liste!L10,L$6)))","v":""},{"$f":"IF(M$4=0,\"\",IF(Liste!M10=\"\",\"\",ROUND(M$4/Liste!M$5*Liste!M10,M$6)))","v":""},{"$f":"IF(N$4=0,\"\",IF(Liste!N10=\"\",\"\",ROUND(N$4/Liste!N$5*Liste!N10,N$6)))","v":""},{"$f":"IF(O$4=0,\"\",IF(Liste!O10=\"\",\"\",ROUND(O$4/Liste!O$5*Liste!O10,O$6)))","v":""},{"$f":"IF(P$4=0,\"\",IF(Liste!P10=\"\",\"\",ROUND(P$4/Liste!P$5*Liste!P10,P$6)))","v":200},{"$f":"IF(Q$4=0,\"\",IF(Liste!Q10=\"\",\"\",ROUND(Q$4/Liste!Q$5*Liste!Q10,Q$6)))","v":""},{"$f":"IF(R$4=0,\"\",IF(Liste!R10=\"\",\"\",ROUND(R$4/Liste!R$5*Liste!R10,R$6)))","v":""},{"$f":"IF(S$4=0,\"\",IF(Liste!S10=\"\",\"\",ROUND(S$4/Liste!S$5*Liste!S10,S$6)))","v":""},{"$f":"IF(T$4=0,\"\",IF(Liste!T10=\"\",\"\",ROUND(T$4/Liste!T$5*Liste!T10,T$6)))","v":""},{"$f":"IF(U$4=0,\"\",IF(Liste!U10=\"\",\"\",ROUND(U$4/Liste!U$5*Liste!U10,U$6)))","v":""},{"$f":"IF(V$4=0,\"\",IF(Liste!V10=\"\",\"\",ROUND(V$4/Liste!V$5*Liste!V10,V$6)))","v":""},{"$f":"IF(W$4=0,\"\",IF(Liste!W10=\"\",\"\",ROUND(W$4/Liste!W$5*Liste!W10,W$6)))","v":""},{"$f":"IF(X$4=0,\"\",IF(Liste!X10=\"\",\"\",ROUND(X$4/Liste!X$5*Liste!X10,X$6)))","v":""},{"$f":"IF(Y$4=0,\"\",IF(Liste!Y10=\"\",\"\",ROUND(Y$4/Liste!Y$5*Liste!Y10,Y$6)))","v":""},{"$f":"IF(Z$4=0,\"\",IF(Liste!Z10=\"\",\"\",ROUND(Z$4/Liste!Z$5*Liste!Z10,Z$6)))","v":""},{"$f":"IF(AA$4=0,\"\",IF(Liste!AA10=\"\",\"\",ROUND(AA$4/Liste!AA$5*Liste!AA10,AA$6)))","v":""},{"$f":"IF(AB$4=0,\"\",IF(Liste!AB10=\"\",\"\",ROUND(AB$4/Liste!AB$5*Liste!AB10,AB$6)))","v":""},{"$f":"IF(AC$4=0,\"\",IF(Liste!AC10=\"\",\"\",ROUND(AC$4/Liste!AC$5*Liste!AC10,AC$6)))","v":""},{"$f":"IF(AD$4=0,\"\",IF(Liste!AD10=\"\",\"\",ROUND(AD$4/Liste!AD$5*Liste!AD10,AD$6)))","v":""},{"$f":"IF(AE$4=0,\"\",IF(Liste!AE10=\"\",\"\",ROUND(AE$4/Liste!AE$5*Liste!AE10,AE$6)))","v":""},{"$f":"IF(AF$4=0,\"\",IF(Liste!AF10=\"\",\"\",ROUND(AF$4/Liste!AF$5*Liste!AF10,AF$6)))","v":""},{"$f":"IF(AG$4=0,\"\",IF(Liste!AG10=\"\",\"\",ROUND(AG$4/Liste!AG$5*Liste!AG10,AG$6)))","v":""},{"$f":"IF(AH$4=0,\"\",IF(Liste!AH10=\"\",\"\",ROUND(AH$4/Liste!AH$5*Liste!AH10,AH$6)))","v":""}]
["",{"$f":"IF(Liste!B11=\"\",\"\",Liste!B11)","v":"Mandeln"},{"$f":"IF(Liste!C11=\"\",\"\",Liste!C11)","v":"gehackt"},{"$f":"IF(Liste!D11=\"\",\"\",Liste!D11)","v":"[g]"},{"$f":"IF(E$4=0,\"\",IF(Liste!E11=\"\",\"\",ROUND(E$4/Liste!E$5*Liste!E11,E$6)))","v":""},{"$f":"IF(F$4=0,\"\",IF(Liste!F11=\"\",\"\",ROUND(F$4/Liste!F$5*Liste!F11,F$6)))","v":""},{"$f":"IF(G$4=0,\"\",IF(Liste!G11=\"\",\"\",ROUND(G$4/Liste!G$5*Liste!G11,G$6)))","v":""},{"$f":"IF(H$4=0,\"\",IF(Liste!H11=\"\",\"\",ROUND(H$4/Liste!H$5*Liste!H11,H$6)))","v":""},{"$f":"IF(I$4=0,\"\",IF(Liste!I11=\"\",\"\",ROUND(I$4/Liste!I$5*Liste!I11,I$6)))","v":""},{"$f":"IF(J$4=0,\"\",IF(Liste!J11=\"\",\"\",ROUND(J$4/Liste!J$5*Liste!J11,J$6)))","v":""},{"$f":"IF(K$4=0,\"\",IF(Liste!K11=\"\",\"\",ROUND(K$4/Liste!K$5*Liste!K11,K$6)))","v":""},{"$f":"IF(L$4=0,\"\",IF(Liste!L11=\"\",\"\",ROUND(L$4/Liste!L$5*Liste!L11,L$6)))","v":""},{"$f":"IF(M$4=0,\"\",IF(Liste!M11=\"\",\"\",ROUND(M$4/Liste!M$5*Liste!M11,M$6)))","v":""},{"$f":"IF(N$4=0,\"\",IF(Liste!N11=\"\",\"\",ROUND(N$4/Liste!N$5*Liste!N11,N$6)))","v":""},{"$f":"IF(O$4=0,\"\",IF(Liste!O11=\"\",\"\",ROUND(O$4/Liste!O$5*Liste!O11,O$6)))","v":""},{"$f":"IF(P$4=0,\"\",IF(Liste!P11=\"\",\"\",ROUND(P$4/Liste!P$5*Liste!P11,P$6)))","v":""},{"$f":"IF(Q$4=0,\"\",IF(Liste!Q11=\"\",\"\",ROUND(Q$4/Liste!Q$5*Liste!Q11,Q$6)))","v":""},{"$f":"IF(R$4=0,\"\",IF(Liste!R11=\"\",\"\",ROUND(R$4/Liste!R$5*Liste!R11,R$6)))","v":""},{"$f":"IF(S$4=0,\"\",IF(Liste!S11=\"\",\"\",ROUND(S$4/Liste!S$5*Liste!S11,S$6)))","v":""},{"$f":"IF(T$4=0,\"\",IF(Liste!T11=\"\",\"\",ROUND(T$4/Liste!T$5*Liste!T11,T$6)))","v":""},{"$f":"IF(U$4=0,\"\",IF(Liste!U11=\"\",\"\",ROUND(U$4/Liste!U$5*Liste!U11,U$6)))","v":""},{"$f":"IF(V$4=0,\"\",IF(Liste!V11=\"\",\"\",ROUND(V$4/Liste!V$5*Liste!V11,V$6)))","v":""},{"$f":"IF(W$4=0,\"\",IF(Liste!W11=\"\",\"\",ROUND(W$4/Liste!W$5*Liste!W11,W$6)))","v":""},{"$f":"IF(X$4=0,\"\",IF(Liste!X11=\"\",\"\",ROUND(X$4/Liste!X$5*Liste!X11,X$6)))","v":""},{"$f":"IF(Y$4=0,\"\",IF(Liste!Y11=\"\",\"\",ROUND(Y$4/Liste!Y$5*Liste!Y11,Y$6)))","v":""},{"$f":"IF(Z$4=0,\"\",IF(Liste!Z11=\"\",\"\",ROUND(Z$4/Liste!Z$5*Liste!Z11,Z$6)))","v":""},{"$f":"IF(AA$4=0,\"\",IF(Liste!AA11=\"\",\"\",ROUND(AA$4/Liste!AA$5*Liste!AA11,AA$6)))","v":""},{"$f":"IF(AB$4=0,\"\",IF(Liste!AB11=\"\",\"\",ROUND(AB$4/Liste!AB$5*Liste!AB11,AB$6)))","v":""},{"$f":"IF(AC$4=0,\"\",IF(Liste!AC11=\"\",\"\",ROUND(AC$4/Liste!AC$5*Liste!AC11,AC$6)))","v":""},{"$f":"IF(AD$4=0,\"\",IF(Liste!AD11=\"\",\"\",ROUND(AD$4/Liste!AD$5*Liste!AD11,AD$6)))","v":""},{"$f":"IF(AE$4=0,\"\",IF(Liste!AE11=\"\",\"\",ROUND(AE$4/Liste!AE$5*Liste!AE11,AE$6)))","v":""},{"$f":"IF(AF$4=0,\"\",IF(Liste!AF11=\"\",\"\",ROUND(AF$4/Liste!AF$5*Liste!AF11,AF$6)))","v":""},{"$f":"IF(AG$4=0,\"\",IF(Liste!AG11=\"\",\"\",ROUND(AG$4/Liste!AG$5*Liste!AG11,AG$6)))","v":""},{"$f":"IF(AH$4=0,\"\",IF(Liste!AH11=\"\",\"\",ROUND(AH$4/Liste!AH$5*Liste!AH11,AH$6)))","v":""}]
[100,{"$f":"IF(Liste!B12=\"\",\"\",Liste!B12)","v":"Mandeln"},{"$f":"IF(Liste!C12=\"\",\"\",Liste!C12)","v":"gehobelt"},{"$f":"IF(Liste!D12=\"\",\"\",Liste!D12)","v":"[g]"},{"$f":"IF(E$4=0,\"\",IF(Liste!E12=\"\",\"\",ROUND(E$4/Liste!E$5*Liste!E12,E$6)))","v":""},{"$f":"IF(F$4=0,\"\",IF(Liste!F12=\"\",\"\",ROUND(F$4/Liste!F$5*Liste!F12,F$6)))","v":""},{"$f":"IF(G$4=0,\"\",IF(Liste!G12=\"\",\"\",ROUND(G$4/Liste!G$5*Liste!G12,G$6)))","v":""},{"$f":"IF(H$4=0,\"\",IF(Liste!H12=\"\",\"\",ROUND(H$4/Liste!H$5*Liste!H12,H$6)))","v":""},{"$f":"IF(I$4=0,\"\",IF(Liste!I12=\"\",\"\",ROUND(I$4/Liste!I$5*Liste!I12,I$6)))","v":""},{"$f":"IF(J$4=0,\"\",IF(Liste!J12=\"\",\"\",ROUND(J$4/Liste!J$5*Liste!J12,J$6)))","v":""},{"$f":"IF(K$4=0,\"\",IF(Liste!K12=\"\",\"\",ROUND(K$4/Liste!K$5*Liste!K12,K$6)))","v":30},{"$f":"IF(L$4=0,\"\",IF(Liste!L12=\"\",\"\",ROUND(L$4/Liste!L$5*Liste!L12,L$6)))","v":""},{"$f":"IF(M$4=0,\"\",IF(Liste!M12=\"\",\"\",ROUND(M$4/Liste!M$5*Liste!M12,M$6)))","v":""},{"$f":"IF(N$4=0,\"\",IF(Liste!N12=\"\",\"\",ROUND(N$4/Liste!N$5*Liste!N12,N$6)))","v":""},{"$f":"IF(O$4=0,\"\",IF(Liste!O12=\"\",\"\",ROUND(O$4/Liste!O$5*Liste!O12,O$6)))","v":70},{"$f":"IF(P$4=0,\"\",IF(Liste!P12=\"\",\"\",ROUND(P$4/Liste!P$5*Liste!P12,P$6)))","v":""},{"$f":"IF(Q$4=0,\"\",IF(Liste!Q12=\"\",\"\",ROUND(Q$4/Liste!Q$5*Liste!Q12,Q$6)))","v":""},{"$f":"IF(R$4=0,\"\",IF(Liste!R12=\"\",\"\",ROUND(R$4/Liste!R$5*Liste!R12,R$6)))","v":""},{"$f":"IF(S$4=0,\"\",IF(Liste!S12=\"\",\"\",ROUND(S$4/Liste!S$5*Liste!S12,S$6)))","v":""},{"$f":"IF(T$4=0,\"\",IF(Liste!T12=\"\",\"\",ROUND(T$4/Liste!T$5*Liste!T12,T$6)))","v":""},{"$f":"IF(U$4=0,\"\",IF(Liste!U12=\"\",\"\",ROUND(U$4/Liste!U$5*Liste!U12,U$6)))","v":""},{"$f":"IF(V$4=0,\"\",IF(Liste!V12=\"\",\"\",ROUND(V$4/Liste!V$5*Liste!V12,V$6)))","v":""},{"$f":"IF(W$4=0,\"\",IF(Liste!W12=\"\",\"\",ROUND(W$4/Liste!W$5*Liste!W12,W$6)))","v":""},{"$f":"IF(X$4=0,\"\",IF(Liste!X12=\"\",\"\",ROUND(X$4/Liste!X$5*Liste!X12,X$6)))","v":""},{"$f":"IF(Y$4=0,\"\",IF(Liste!Y12=\"\",\"\",ROUND(Y$4/Liste!Y$5*Liste!Y12,Y$6)))","v":""},{"$f":"IF(Z$4=0,\"\",IF(Liste!Z12=\"\",\"\",ROUND(Z$4/Liste!Z$5*Liste!Z12,Z$6)))","v":""},{"$f":"IF(AA$4=0,\"\",IF(Liste!AA12=\"\",\"\",ROUND(AA$4/Liste!AA$5*Liste!AA12,AA$6)))","v":""},{"$f":"IF(AB$4=0,\"\",IF(Liste!AB12=\"\",\"\",ROUND(AB$4/Liste!AB$5*Liste!AB12,AB$6)))","v":""},{"$f":"IF(AC$4=0,\"\",IF(Liste!AC12=\"\",\"\",ROUND(AC$4/Liste!AC$5*Liste!AC12,AC$6)))","v":""},{"$f":"IF(AD$4=0,\"\",IF(Liste!AD12=\"\",\"\",ROUND(AD$4/Liste!AD$5*Liste!AD12,AD$6)))","v":""},{"$f":"IF(AE$4=0,\"\",IF(Liste!AE12=\"\",\"\",ROUND(AE$4/Liste!AE$5*Liste!AE12,AE$6)))","v":""},{"$f":"IF(AF$4=0,\"\",IF(Liste!AF12=\"\",\"\",ROUND(AF$4/Liste!AF$5*Liste!AF12,AF$6)))","v":""},{"$f":"IF(AG$4=0,\"\",IF(Liste!AG12=\"\",\"\",ROUND(AG$4/Liste!AG$5*Liste!AG12,AG$6)))","v":""},{"$f":"IF(AH$4=0,\"\",IF(Liste!AH12=\"\",\"\",ROUND(AH$4/Liste!AH$5*Liste!AH12,AH$6)))","v":""}]
[60,{"$f":"IF(Liste!B13=\"\",\"\",Liste!B13)","v":"Mandelblättchen"},{"$f":"IF(Liste!C13=\"\",\"\",Liste!C13)","v":""},{"$f":"IF(Liste!D13=\"\",\"\",Liste!D13)","v":"[St.]"},{"$f":"IF(E$4=0,\"\",IF(Liste!E13=\"\",\"\",ROUND(E$4/Liste!E$5*Liste!E13,E$6)))","v":""},{"$f":"IF(F$4=0,\"\",IF(Liste!F13=\"\",\"\",ROUND(F$4/Liste!F$5*Liste!F13,F$6)))","v":""},{"$f":"IF(G$4=0,\"\",IF(Liste!G13=\"\",\"\",ROUND(G$4/Liste!G$5*Liste!G13,G$6)))","v":""},{"$f":"IF(H$4=0,\"\",IF(Liste!H13=\"\",\"\",ROUND(H$4/Liste!H$5*Liste!H13,H$6)))","v":""},{"$f":"IF(I$4=0,\"\",IF(Liste!I13=\"\",\"\",ROUND(I$4/Liste!I$5*Liste!I13,I$6)))","v":""},{"$f":"IF(J$4=0,\"\",IF(Liste!J13=\"\",\"\",ROUND(J$4/Liste!J$5*Liste!J13,J$6)))","v":""},{"$f":"IF(K$4=0,\"\",IF(Liste!K13=\"\",\"\",ROUND(K$4/Liste!K$5*Liste!K13,K$6)))","v":""},{"$f":"IF(L$4=0,\"\",IF(Liste!L13=\"\",\"\",ROUND(L$4/Liste!L$5*Liste!L13,L$6)))","v":""},{"$f":"IF(M$4=0,\"\",IF(Liste!M13=\"\",\"\",ROUND(M$4/Liste!M$5*Liste!M13,M$6)))","v":""},{"$f":"IF(N$4=0,\"\",IF(Liste!N13=\"\",\"\",ROUND(N$4/Liste!N$5*Liste!N13,N$6)))","v":""},{"$f":"IF(O$4=0,\"\",IF(Liste!O13=\"\",\"\",ROUND(O$4/Liste!O$5*Liste!O13,O$6)))","v":""},{"$f":"IF(P$4=0,\"\",IF(Liste!P13=\"\",\"\",ROUND(P$4/Liste!P$5*Liste!P13,P$6)))","v":""},{"$f":"IF(Q$4=0,\"\",IF(Liste!Q13=\"\",\"\",ROUND(Q$4/Liste!Q$5*Liste!Q13,Q$6)))","v":""},{"$f":"IF(R$4=0,\"\",IF(Liste!R13=\"\",\"\",ROUND(R$4/Liste!R$5*Liste!R13,R$6)))","v":""},{"$f":"IF(S$4=0,\"\",IF(Liste!S13=\"\",\"\",ROUND(S$4/Liste!S$5*Liste!S13,S$6)))","v":60},{"$f":"IF(T$4=0,\"\",IF(Liste!T13=\"\",\"\",ROUND(T$4/Liste!T$5*Liste!T13,T$6)))","v":""},{"$f":"IF(U$4=0,\"\",IF(Liste!U13=\"\",\"\",ROUND(U$4/Liste!U$5*Liste!U13,U$6)))","v":""},{"$f":"IF(V$4=0,\"\",IF(Liste!V13=\"\",\"\",ROUND(V$4/Liste!V$5*Liste!V13,V$6)))","v":""},{"$f":"IF(W$4=0,\"\",IF(Liste!W13=\"\",\"\",ROUND(W$4/Liste!W$5*Liste!W13,W$6)))","v":""},{"$f":"IF(X$4=0,\"\",IF(Liste!X13=\"\",\"\",ROUND(X$4/Liste!X$5*Liste!X13,X$6)))","v":""},{"$f":"IF(Y$4=0,\"\",IF(Liste!Y13=\"\",\"\",ROUND(Y$4/Liste!Y$5*Liste!Y13,Y$6)))","v":""},{"$f":"IF(Z$4=0,\"\",IF(Liste!Z13=\"\",\"\",ROUND(Z$4/Liste!Z$5*Liste!Z13,Z$6)))","v":""},{"$f":"IF(AA$4=0,\"\",IF(Liste!AA13=\"\",\"\",ROUND(AA$4/Liste!AA$5*Liste!AA13,AA$6)))","v":""},{"$f":"IF(AB$4=0,\"\",IF(Liste!AB13=\"\",\"\",ROUND(AB$4/Liste!AB$5*Liste!AB13,AB$6)))","v":""},{"$f":"IF(AC$4=0,\"\",IF(Liste!AC13=\"\",\"\",ROUND(AC$4/Liste!AC$5*Liste!AC13,AC$6)))","v":""},{"$f":"IF(AD$4=0,\"\",IF(Liste!AD13=\"\",\"\",ROUND(AD$4/Liste!AD$5*Liste!AD13,AD$6)))","v":""},{"$f":"IF(AE$4=0,\"\",IF(Liste!AE13=\"\",\"\",ROUND(AE$4/Liste!AE$5*Liste!AE13,AE$6)))","v":""},{"$f":"IF(AF$4=0,\"\",IF(Liste!AF13=\"\",\"\",ROUND(AF$4/Liste!AF$5*Liste!AF13,AF$6)))","v":""},{"$f":"IF(AG$4=0,\"\",IF(Liste!AG13=\"\",\"\",ROUND(AG$4/Liste!AG$5*Liste!AG13,AG$6)))","v":""},{"$f":"IF(AH$4=0,\"\",IF(Liste!AH13=\"\",\"\",ROUND(AH$4/Liste!AH$5*Liste!AH13,AH$6)))","v":""}]
["",{"$f":"IF(Liste!B14=\"\",\"\",Liste!B14)","v":"Haselnüsse"},{"$f":"IF(Liste!C14=\"\",\"\",Liste!C14)","v":""},{"$f":"IF(Liste!D14=\"\",\"\",Liste!D14)","v":"[g]"},{"$f":"IF(E$4=0,\"\",IF(Liste!E14=\"\",\"\",ROUND(E$4/Liste!E$5*Liste!E14,E$6)))","v":""},{"$f":"IF(F$4=0,\"\",IF(Liste!F14=\"\",\"\",ROUND(F$4/Liste!F$5*Liste!F14,F$6)))","v":""},{"$f":"IF(G$4=0,\"\",IF(Liste!G14=\"\",\"\",ROUND(G$4/Liste!G$5*Liste!G14,G$6)))","v":""},{"$f":"IF(H$4=0,\"\",IF(Liste!H14=\"\",\"\",ROUND(H$4/Liste!H$5*Liste!H14,H$6)))","v":""},{"$f":"IF(I$4=0,\"\",IF(Liste!I14=\"\",\"\",ROUND(I$4/Liste!I$5*Liste!I14,I$6)))","v":""},{"$f":"IF(J$4=0,\"\",IF(Liste!J14=\"\",\"\",ROUND(J$4/Liste!J$5*Liste!J14,J$6)))","v":""},{"$f":"IF(K$4=0,\"\",IF(Liste!K14=\"\",\"\",ROUND(K$4/Liste!K$5*Liste!K14,K$6)))","v":""},{"$f":"IF(L$4=0,\"\",IF(Liste!L14=\"\",\"\",ROUND(L$4/Liste!L$5*Liste!L14,L$6)))","v":""},{"$f":"IF(M$4=0,\"\",IF(Liste!M14=\"\",\"\",ROUND(M$4/Liste!M$5*Liste!M14,M$6)))","v":""},{"$f":"IF(N$4=0,\"\",IF(Liste!N14=\"\",\"\",ROUND(N$4/Liste!N$5*Liste!N14,N$6)))","v":""},{"$f":"IF(O$4=0,\"\",IF(Liste!O14=\"\",\"\",ROUND(O$4/Liste!O$5*Liste!O14,O$6)))","v":""},{"$f":"IF(P$4=0,\"\",IF(Liste!P14=\"\",\"\",ROUND(P$4/Liste!P$5*Liste!P14,P$6)))","v":""},{"$f":"IF(Q$4=0,\"\",IF(Liste!Q14=\"\",\"\",ROUND(Q$4/Liste!Q$5*Liste!Q14,Q$6)))","v":""},{"$f":"IF(R$4=0,\"\",IF(Liste!R14=\"\",\"\",ROUND(R$4/Liste!R$5*Liste!R14,R$6)))","v":""},{"$f":"IF(S$4=0,\"\",IF(Liste!S14=\"\",\"\",ROUND(S$4/Liste!S$5*Liste!S14,S$6)))","v":""},{"$f":"IF(T$4=0,\"\",IF(Liste!T14=\"\",\"\",ROUND(T$4/Liste!T$5*Liste!T14,T$6)))","v":""},{"$f":"IF(U$4=0,\"\",IF(Liste!U14=\"\",\"\",ROUND(U$4/Liste!U$5*Liste!U14,U$6)))","v":""},{"$f":"IF(V$4=0,\"\",IF(Liste!V14=\"\",\"\",ROUND(V$4/Liste!V$5*Liste!V14,V$6)))","v":""},{"$f":"IF(W$4=0,\"\",IF(Liste!W14=\"\",\"\",ROUND(W$4/Liste!W$5*Liste!W14,W$6)))","v":""},{"$f":"IF(X$4=0,\"\",IF(Liste!X14=\"\",\"\",ROUND(X$4/Liste!X$5*Liste!X14,X$6)))","v":""},{"$f":"IF(Y$4=0,\"\",IF(Liste!Y14=\"\",\"\",ROUND(Y$4/Liste!Y$5*Liste!Y14,Y$6)))","v":""},{"$f":"IF(Z$4=0,\"\",IF(Liste!Z14=\"\",\"\",ROUND(Z$4/Liste!Z$5*Liste!Z14,Z$6)))","v":""},{"$f":"IF(AA$4=0,\"\",IF(Liste!AA14=\"\",\"\",ROUND(AA$4/Liste!AA$5*Liste!AA14,AA$6)))","v":""},{"$f":"IF(AB$4=0,\"\",IF(Liste!AB14=\"\",\"\",ROUND(AB$4/Liste!AB$5*Liste!AB14,AB$6)))","v":""},{"$f":"IF(AC$4=0,\"\",IF(Liste!AC14=\"\",\"\",ROUND(AC$4/Liste!AC$5*Liste!AC14,AC$6)))","v":""},{"$f":"IF(AD$4=0,\"\",IF(Liste!AD14=\"\",\"\",ROUND(AD$4/Liste!AD$5*Liste!AD14,AD$6)))","v":""},{"$f":"IF(AE$4=0,\"\",IF(Liste!AE14=\"\",\"\",ROUND(AE$4/Liste!AE$5*Liste!AE14,AE$6)))","v":""},{"$f":"IF(AF$4=0,\"\",IF(Liste!AF14=\"\",\"\",ROUND(AF$4/Liste!AF$5*Liste!AF14,AF$6)))","v":""},{"$f":"IF(AG$4=0,\"\",IF(Liste!AG14=\"\",\"\",ROUND(AG$4/Liste!AG$5*Liste!AG14,AG$6)))","v":""},{"$f":"IF(AH$4=0,\"\",IF(Liste!AH14=\"\",\"\",ROUND(AH$4/Liste!AH$5*Liste!AH14,AH$6)))","v":""}]
["",{"$f":"IF(Liste!B15=\"\",\"\",Liste!B15)","v":"Haselnüsse"},{"$f":"IF(Liste!C15=\"\",\"\",Liste!C15)","v":"gehackt"},{"$f":"IF(Liste!D15=\"\",\"\",Liste!D15)","v":"[g]"},{"$f":"IF(E$4=0,\"\",IF(Liste!E15=\"\",\"\",ROUND(E$4/Liste!E$5*Liste!E15,E$6)))","v":""},{"$f":"IF(F$4=0,\"\",IF(Liste!F15=\"\",\"\",ROUND(F$4/Liste!F$5*Liste!F15,F$6)))","v":""},{"$f":"IF(G$4=0,\"\",IF(Liste!G15=\"\",\"\",ROUND(G$4/Liste!G$5*Liste!G15,G$6)))","v":""},{"$f":"IF(H$4=0,\"\",IF(Liste!H15=\"\",\"\",ROUND(H$4/Liste!H$5*Liste!H15,H$6)))","v":""},{"$f":"IF(I$4=0,\"\",IF(Liste!I15=\"\",\"\",ROUND(I$4/Liste!I$5*Liste!I15,I$6)))","v":""},{"$f":"IF(J$4=0,\"\",IF(Liste!J15=\"\",\"\",ROUND(J$4/Liste!J$5*Liste!J15,J$6)))","v":""},{"$f":"IF(K$4=0,\"\",IF(Liste!K15=\"\",\"\",ROUND(K$4/Liste!K$5*Liste!K15,K$6)))","v":""},{"$f":"IF(L$4=0,\"\",IF(Liste!L15=\"\",\"\",ROUND(L$4/Liste!L$5*Liste!L15,L$6)))","v":""},{"$f":"IF(M$4=0,\"\",IF(Liste!M15=\"\",\"\",ROUND(M$4/Liste!M$5*Liste!M15,M$6)))","v":""},{"$f":"IF(N$4=0,\"\",IF(Liste!N15=\"\",\"\",ROUND(N$4/Liste!N$5*Liste!N15,N$6)))","v":""},{"$f":"IF(O$4=0,\"\",IF(Liste!O15=\"\",\"\",ROUND(O$4/Liste!O$5*Liste!O15,O$6)))","v":""},{"$f":"IF(P$4=0,\"\",IF(Liste!P15=\"\",\"\",ROUND(P$4/Liste!P$5*Liste!P15,P$6)))","v":""},{"$f":"IF(Q$4=0,\"\",IF(Liste!Q15=\"\",\"\",ROUND(Q$4/Liste!Q$5*Liste!Q15,Q$6)))","v":""},{"$f":"IF(R$4=0,\"\",IF(Liste!R15=\"\",\"\",ROUND(R$4/Liste!R$5*Liste!R15,R$6)))","v":""},{"$f":"IF(S$4=0,\"\",IF(Liste!S15=\"\",\"\",ROUND(S$4/Liste!S$5*Liste!S15,S$6)))","v":""},{"$f":"IF(T$4=0,\"\",IF(Liste!T15=\"\",\"\",ROUND(T$4/Liste!T$5*Liste!T15,T$6)))","v":""},{"$f":"IF(U$4=0,\"\",IF(Liste!U15=\"\",\"\",ROUND(U$4/Liste!U$5*Liste!U15,U$6)))","v":""},{"$f":"IF(V$4=0,\"\",IF(Liste!V15=\"\",\"\",ROUND(V$4/Liste!V$5*Liste!V15,V$6)))","v":""},{"$f":"IF(W$4=0,\"\",IF(Liste!W15=\"\",\"\",ROUND(W$4/Liste!W$5*Liste!W15,W$6)))","v":""},{"$f":"IF(X$4=0,\"\",IF(Liste!X15=\"\",\"\",ROUND(X$4/Liste!X$5*Liste!X15,X$6)))","v":""},{"$f":"IF(Y$4=0,\"\",IF(Liste!Y15=\"\",\"\",ROUND(Y$4/Liste!Y$5*Liste!Y15,Y$6)))","v":""},{"$f":"IF(Z$4=0,\"\",IF(Liste!Z15=\"\",\"\",ROUND(Z$4/Liste!Z$5*Liste!Z15,Z$6)))","v":""},{"$f":"IF(AA$4=0,\"\",IF(Liste!AA15=\"\",\"\",ROUND(AA$4/Liste!AA$5*Liste!AA15,AA$6)))","v":""},{"$f":"IF(AB$4=0,\"\",IF(Liste!AB15=\"\",\"\",ROUND(AB$4/Liste!AB$5*Liste!AB15,AB$6)))","v":""},{"$f":"IF(AC$4=0,\"\",IF(Liste!AC15=\"\",\"\",ROUND(AC$4/Liste!AC$5*Liste!AC15,AC$6)))","v":""},{"$f":"IF(AD$4=0,\"\",IF(Liste!AD15=\"\",\"\",ROUND(AD$4/Liste!AD$5*Liste!AD15,AD$6)))","v":""},{"$f":"IF(AE$4=0,\"\",IF(Liste!AE15=\"\",\"\",ROUND(AE$4/Liste!AE$5*Liste!AE15,AE$6)))","v":""},{"$f":"IF(AF$4=0,\"\",IF(Liste!AF15=\"\",\"\",ROUND(AF$4/Liste!AF$5*Liste!AF15,AF$6)))","v":""},{"$f":"IF(AG$4=0,\"\",IF(Liste!AG15=\"\",\"\",ROUND(AG$4/Liste!AG$5*Liste!AG15,AG$6)))","v":""},{"$f":"IF(AH$4=0,\"\",IF(Liste!AH15=\"\",\"\",ROUND(AH$4/Liste!AH$5*Liste!AH15,AH$6)))","v":""}]
[125,{"$f":"IF(Liste!B16=\"\",\"\",Liste!B16)","v":"Kokosraspel"},{"$f":"IF(Liste!C16=\"\",\"\",Liste!C16)","v":""},{"$f":"IF(Liste!D16=\"\",\"\",Liste!D16)","v":"[g]"},{"$f":"IF(E$4=0,\"\",IF(Liste!E16=\"\",\"\",ROUND(E$4/Liste!E$5*Liste!E16,E$6)))","v":""},{"$f":"IF(F$4=0,\"\",IF(Liste!F16=\"\",\"\",ROUND(F$4/Liste!F$5*Liste!F16,F$6)))","v":""},{"$f":"IF(G$4=0,\"\",IF(Liste!G16=\"\",\"\",ROUND(G$4/Liste!G$5*Liste!G16,G$6)))","v":""},{"$f":"IF(H$4=0,\"\",IF(Liste!H16=\"\",\"\",ROUND(H$4/Liste!H$5*Liste!H16,H$6)))","v":""},{"$f":"IF(I$4=0,\"\",IF(Liste!I16=\"\",\"\",ROUND(I$4/Liste!I$5*Liste!I16,I$6)))","v":""},{"$f":"IF(J$4=0,\"\",IF(Liste!J16=\"\",\"\",ROUND(J$4/Liste!J$5*Liste!J16,J$6)))","v":""},{"$f":"IF(K$4=0,\"\",IF(Liste!K16=\"\",\"\",ROUND(K$4/Liste!K$5*Liste!K16,K$6)))","v":""},{"$f":"IF(L$4=0,\"\",IF(Liste!L16=\"\",\"\",ROUND(L$4/Liste!L$5*Liste!L16,L$6)))","v":""},{"$f":"IF(M$4=0,\"\",IF(Liste!M16=\"\",\"\",ROUND(M$4/Liste!M$5*Liste!M16,M$6)))","v":""},{"$f":"IF(N$4=0,\"\",IF(Liste!N16=\"\",\"\",ROUND(N$4/Liste!N$5*Liste!N16,N$6)))","v":""},{"$f":"IF(O$4=0,\"\",IF(Liste!O16=\"\",\"\",ROUND(O$4/Liste!O$5*Liste!O16,O$6)))","v":""},{"$f":"IF(P$4=0,\"\",IF(Liste!P16=\"\",\"\",ROUND(P$4/Liste!P$5*Liste!P16,P$6)))","v":""},{"$f":"IF(Q$4=0,\"\",IF(Liste!Q16=\"\",\"\",ROUND(Q$4/Liste!Q$5*Liste!Q16,Q$6)))","v":""},{"$f":"IF(R$4=0,\"\",IF(Liste!R16=\"\",\"\",ROUND(R$4/Liste!R$5*Liste!R16,R$6)))","v":""},{"$f":"IF(S$4=0,\"\",IF(Liste!S16=\"\",\"\",ROUND(S$4/Liste!S$5*Liste!S16,S$6)))","v":""},{"$f":"IF(T$4=0,\"\",IF(Liste!T16=\"\",\"\",ROUND(T$4/Liste!T$5*Liste!T16,T$6)))","v":""},{"$f":"IF(U$4=0,\"\",IF(Liste!U16=\"\",\"\",ROUND(U$4/Liste!U$5*Liste!U16,U$6)))","v":""},{"$f":"IF(V$4=0,\"\",IF(Liste!V16=\"\",\"\",ROUND(V$4/Liste!V$5*Liste!V16,V$6)))","v":125},{"$f":"IF(W$4=0,\"\",IF(Liste!W16=\"\",\"\",ROUND(W$4/Liste!W$5*Liste!W16,W$6)))","v":""},{"$f":"IF(X$4=0,\"\",IF(Liste!X16=\"\",\"\",ROUND(X$4/Liste!X$5*Liste!X16,X$6)))","v":""},{"$f":"IF(Y$4=0,\"\",IF(Liste!Y16=\"\",\"\",ROUND(Y$4/Liste!Y$5*Liste!Y16,Y$6)))","v":""},{"$f":"IF(Z$4=0,\"\",IF(Liste!Z16=\"\",\"\",ROUND(Z$4/Liste!Z$5*Liste!Z16,Z$6)))","v":""},{"$f":"IF(AA$4=0,\"\",IF(Liste!AA16=\"\",\"\",ROUND(AA$4/Liste!AA$5*Liste!AA16,AA$6)))","v":""},{"$f":"IF(AB$4=0,\"\",IF(Liste!AB16=\"\",\"\",ROUND(AB$4/Liste!AB$5*Liste!AB16,AB$6)))","v":""},{"$f":"IF(AC$4=0,\"\",IF(Liste!AC16=\"\",\"\",ROUND(AC$4/Liste!AC$5*Liste!AC16,AC$6)))","v":""},{"$f":"IF(AD$4=0,\"\",IF(Liste!AD16=\"\",\"\",ROUND(AD$4/Liste!AD$5*Liste!AD16,AD$6)))","v":""},{"$f":"IF(AE$4=0,\"\",IF(Liste!AE16=\"\",\"\",ROUND(AE$4/Liste!AE$5*Liste!AE16,AE$6)))","v":""},{"$f":"IF(AF$4=0,\"\",IF(Liste!AF16=\"\",\"\",ROUND(AF$4/Liste!AF$5*Liste!AF16,AF$6)))","v":""},{"$f":"IF(AG$4=0,\"\",IF(Liste!AG16=\"\",\"\",ROUND(AG$4/Liste!AG$5*Liste!AG16,AG$6)))","v":""},{"$f":"IF(AH$4=0,\"\",IF(Liste!AH16=\"\",\"\",ROUND(AH$4/Liste!AH$5*Liste!AH16,AH$6)))","v":""}]
[{"$f":"IF(SUM($E17:$AH17)=0,\"\",SUM($E17:$AH17))","v":""},{"$f":"IF(Liste!B17=\"\",\"\",Liste!B17)","v":"Pistazien"},{"$f":"IF(Liste!C17=\"\",\"\",Liste!C17)","v":"gehackt"},{"$f":"IF(Liste!D17=\"\",\"\",Liste!D17)","v":"[g]"},{"$f":"IF(E$4=0,\"\",IF(Liste!E17=\"\",\"\",ROUND(E$4/Liste!E$5*Liste!E17,E$6)))","v":""},{"$f":"IF(F$4=0,\"\",IF(Liste!F17=\"\",\"\",ROUND(F$4/Liste!F$5*Liste!F17,F$6)))","v":""},{"$f":"IF(G$4=0,\"\",IF(Liste!G17=\"\",\"\",ROUND(G$4/Liste!G$5*Liste!G17,G$6)))","v":""},{"$f":"IF(H$4=0,\"\",IF(Liste!H17=\"\",\"\",ROUND(H$4/Liste!H$5*Liste!H17,H$6)))","v":""},{"$f":"IF(I$4=0,\"\",IF(Liste!I17=\"\",\"\",ROUND(I$4/Liste!I$5*Liste!I17,I$6)))","v":""},{"$f":"IF(J$4=0,\"\",IF(Liste!J17=\"\",\"\",ROUND(J$4/Liste!J$5*Liste!J17,J$6)))","v":""},{"$f":"IF(K$4=0,\"\",IF(Liste!K17=\"\",\"\",ROUND(K$4/Liste!K$5*Liste!K17,K$6)))","v":""},{"$f":"IF(L$4=0,\"\",IF(Liste!L17=\"\",\"\",ROUND(L$4/Liste!L$5*Liste!L17,L$6)))","v":""},{"$f":"IF(M$4=0,\"\",IF(Liste!M17=\"\",\"\",ROUND(M$4/Liste!M$5*Liste!M17,M$6)))","v":""},{"$f":"IF(N$4=0,\"\",IF(Liste!N17=\"\",\"\",ROUND(N$4/Liste!N$5*Liste!N17,N$6)))","v":""},{"$f":"IF(O$4=0,\"\",IF(Liste!O17=\"\",\"\",ROUND(O$4/Liste!O$5*Liste!O17,O$6)))","v":""},{"$f":"IF(P$4=0,\"\",IF(Liste!P17=\"\",\"\",ROUND(P$4/Liste!P$5*Liste!P17,P$6)))","v":""},{"$f":"IF(Q$4=0,\"\",IF(Liste!Q17=\"\",\"\",ROUND(Q$4/Liste!Q$5*Liste!Q17,Q$6)))","v":""},{"$f":"IF(R$4=0,\"\",IF(Liste!R17=\"\",\"\",ROUND(R$4/Liste!R$5*Liste!R17,R$6)))","v":""},{"$f":"IF(S$4=0,\"\",IF(Liste!S17=\"\",\"\",ROUND(S$4/Liste!S$5*Liste!S17,S$6)))","v":""},{"$f":"IF(T$4=0,\"\",IF(Liste!T17=\"\",\"\",ROUND(T$4/Liste!T$5*Liste!T17,T$6)))","v":""},{"$f":"IF(U$4=0,\"\",IF(Liste!U17=\"\",\"\",ROUND(U$4/Liste!U$5*Liste!U17,U$6)))","v":""},{"$f":"IF(V$4=0,\"\",IF(Liste!V17=\"\",\"\",ROUND(V$4/Liste!V$5*Liste!V17,V$6)))","v":""},{"$f":"IF(W$4=0,\"\",IF(Liste!W17=\"\",\"\",ROUND(W$4/Liste!W$5*Liste!W17,W$6)))","v":""},{"$f":"IF(X$4=0,\"\",IF(Liste!X17=\"\",\"\",ROUND(X$4/Liste!X$5*Liste!X17,X$6)))","v":""},{"$f":"IF(Y$4=0,\"\",IF(Liste!Y17=\"\",\"\",ROUND(Y$4/Liste!Y$5*Liste!Y17,Y$6)))","v":""},{"$f":"IF(Z$4=0,\"\",IF(Liste!Z17=\"\",\"\",ROUND(Z$4/Liste!Z$5*Liste!Z17,Z$6)))","v":""},{"$f":"IF(AA$4=0,\"\",IF(Liste!AA17=\"\",\"\",ROUND(AA$4/Liste!AA$5*Liste!AA17,AA$6)))","v":""},{"$f":"IF(AB$4=0,\"\",IF(Liste!AB17=\"\",\"\",ROUND(AB$4/Liste!AB$5*Liste!AB17,AB$6)))","v":""},{"$f":"IF(AC$4=0,\"\",IF(Liste!AC17=\"\",\"\",ROUND(AC$4/Liste!AC$5*Liste!AC17,AC$6)))","v":""},{"$f":"IF(AD$4=0,\"\",IF(Liste!AD17=\"\",\"\",ROUND(AD$4/Liste!AD$5*Liste!AD17,AD$6)))","v":""},{"$f":"IF(AE$4=0,\"\",IF(Liste!AE17=\"\",\"\",ROUND(AE$4/Liste!AE$5*Liste!AE17,AE$6)))","v":""},{"$f":"IF(AF$4=0,\"\",IF(Liste!AF17=\"\",\"\",ROUND(AF$4/Liste!AF$5*Liste!AF17,AF$6)))","v":""},{"$f":"IF(AG$4=0,\"\",IF(Liste!AG17=\"\",\"\",ROUND(AG$4/Liste!AG$5*Liste!AG17,AG$6)))","v":""},{"$f":"IF(AH$4=0,\"\",IF(Liste!AH17=\"\",\"\",ROUND(AH$4/Liste!AH$5*Liste!AH17,AH$6)))","v":""}]
[200,{"$f":"IF(Liste!B18=\"\",\"\",Liste!B18)","v":"Walnüsse"},{"$f":"IF(Liste!C18=\"\",\"\",Liste!C18)","v":"gemahlen"},{"$f":"IF(Liste!D18=\"\",\"\",Liste!D18)","v":"[g]"},{"$f":"IF(E$4=0,\"\",IF(Liste!E18=\"\",\"\",ROUND(E$4/Liste!E$5*Liste!E18,E$6)))","v":""},{"$f":"IF(F$4=0,\"\",IF(Liste!F18=\"\",\"\",ROUND(F$4/Liste!F$5*Liste!F18,F$6)))","v":""},{"$f":"IF(G$4=0,\"\",IF(Liste!G18=\"\",\"\",ROUND(G$4/Liste!G$5*Liste!G18,G$6)))","v":""},{"$f":"IF(H$4=0,\"\",IF(Liste!H18=\"\",\"\",ROUND(H$4/Liste!H$5*Liste!H18,H$6)))","v":""},{"$f":"IF(I$4=0,\"\",IF(Liste!I18=\"\",\"\",ROUND(I$4/Liste!I$5*Liste!I18,I$6)))","v":""},{"$f":"IF(J$4=0,\"\",IF(Liste!J18=\"\",\"\",ROUND(J$4/Liste!J$5*Liste!J18,J$6)))","v":""},{"$f":"IF(K$4=0,\"\",IF(Liste!K18=\"\",\"\",ROUND(K$4/Liste!K$5*Liste!K18,K$6)))","v":""},{"$f":"IF(L$4=0,\"\",IF(Liste!L18=\"\",\"\",ROUND(L$4/Liste!L$5*Liste!L18,L$6)))","v":""},{"$f":"IF(M$4=0,\"\",IF(Liste!M18=\"\",\"\",ROUND(M$4/Liste!M$5*Liste!M18,M$6)))","v":""},{"$f":"IF(N$4=0,\"\",IF(Liste!N18=\"\",\"\",ROUND(N$4/Liste!N$5*Liste!N18,N$6)))","v":""},{"$f":"IF(O$4=0,\"\",IF(Liste!O18=\"\",\"\",ROUND(O$4/Liste!O$5*Liste!O18,O$6)))","v":""},{"$f":"IF(P$4=0,\"\",IF(Liste!P18=\"\",\"\",ROUND(P$4/Liste!P$5*Liste!P18,P$6)))","v":""},{"$f":"IF(Q$4=0,\"\",IF(Liste!Q18=\"\",\"\",ROUND(Q$4/Liste!Q$5*Liste!Q18,Q$6)))","v":""},{"$f":"IF(R$4=0,\"\",IF(Liste!R18=\"\",\"\",ROUND(R$4/Liste!R$5*Liste!R18,R$6)))","v":""},{"$f":"IF(S$4=0,\"\",IF(Liste!S18=\"\",\"\",ROUND(S$4/Liste!S$5*Liste!S18,S$6)))","v":200},{"$f":"IF(T$4=0,\"\",IF(Liste!T18=\"\",\"\",ROUND(T$4/Liste!T$5*Liste!T18,T$6)))","v":""},{"$f":"IF(U$4=0,\"\",IF(Liste!U18=\"\",\"\",ROUND(U$4/Liste!U$5*Liste!U18,U$6)))","v":""},{"$f":"IF(V$4=0,\"\",IF(Liste!V18=\"\",\"\",ROUND(V$4/Liste!V$5*Liste!V18,V$6)))","v":""},{"$f":"IF(W$4=0,\"\",IF(Liste!W18=\"\",\"\",ROUND(W$4/Liste!W$5*Liste!W18,W$6)))","v":""},{"$f":"IF(X$4=0,\"\",IF(Liste!X18=\"\",\"\",ROUND(X$4/Liste!X$5*Liste!X18,X$6)))","v":""},{"$f":"IF(Y$4=0,\"\",IF(Liste!Y18=\"\",\"\",ROUND(Y$4/Liste!Y$5*Liste!Y18,Y$6)))","v":""},{"$f":"IF(Z$4=0,\"\",IF(Liste!Z18=\"\",\"\",ROUND(Z$4/Liste!Z$5*Liste!Z18,Z$6)))","v":""},{"$f":"IF(AA$4=0,\"\",IF(Liste!AA18=\"\",\"\",ROUND(AA$4/Liste!AA$5*Liste!AA18,AA$6)))","v":""},{"$f":"IF(AB$4=0,\"\",IF(Liste!AB18=\"\",\"\",ROUND(AB$4/Liste!AB$5*Liste!AB18,AB$6)))","v":""},{"$f":"IF(AC$4=0,\"\",IF(Liste!AC18=\"\",\"\",ROUND(AC$4/Liste!AC$5*Liste!AC18,AC$6)))","v":""},{"$f":"IF(AD$4=0,\"\",IF(Liste!AD18=\"\",\"\",ROUND(AD$4/Liste!AD$5*Liste!AD18,AD$6)))","v":""},{"$f":"IF(AE$4=0,\"\",IF(Liste!AE18=\"\",\"\",ROUND(AE$4/Liste!AE$5*Liste!AE18,AE$6)))","v":""},{"$f":"IF(AF$4=0,\"\",IF(Liste!AF18=\"\",\"\",ROUND(AF$4/Liste!AF$5*Liste!AF18,AF$6)))","v":""},{"$f":"IF(AG$4=0,\"\",IF(Liste!AG18=\"\",\"\",ROUND(AG$4/Liste!AG$5*Liste!AG18,AG$6)))","v":""},{"$f":"IF(AH$4=0,\"\",IF(Liste!AH18=\"\",\"\",ROUND(AH$4/Liste!AH$5*Liste!AH18,AH$6)))","v":""}]
[300,{"$f":"IF(Liste!B19=\"\",\"\",Liste!B19)","v":"Marzipanrohmasse"},{"$f":"IF(Liste!C19=\"\",\"\",Liste!C19)","v":""},{"$f":"IF(Liste!D19=\"\",\"\",Liste!D19)","v":"[g]"},{"$f":"IF(E$4=0,\"\",IF(Liste!E19=\"\",\"\",ROUND(E$4/Liste!E$5*Liste!E19,E$6)))","v":""},{"$f":"IF(F$4=0,\"\",IF(Liste!F19=\"\",\"\",ROUND(F$4/Liste!F$5*Liste!F19,F$6)))","v":""},{"$f":"IF(G$4=0,\"\",IF(Liste!G19=\"\",\"\",ROUND(G$4/Liste!G$5*Liste!G19,G$6)))","v":""},{"$f":"IF(H$4=0,\"\",IF(Liste!H19=\"\",\"\",ROUND(H$4/Liste!H$5*Liste!H19,H$6)))","v":""},{"$f":"IF(I$4=0,\"\",IF(Liste!I19=\"\",\"\",ROUND(I$4/Liste!I$5*Liste!I19,I$6)))","v":""},{"$f":"IF(J$4=0,\"\",IF(Liste!J19=\"\",\"\",ROUND(J$4/Liste!J$5*Liste!J19,J$6)))","v":""},{"$f":"IF(K$4=0,\"\",IF(Liste!K19=\"\",\"\",ROUND(K$4/Liste!K$5*Liste!K19,K$6)))","v":""},{"$f":"IF(L$4=0,\"\",IF(Liste!L19=\"\",\"\",ROUND(L$4/Liste!L$5*Liste!L19,L$6)))","v":200},{"$f":"IF(M$4=0,\"\",IF(Liste!M19=\"\",\"\",ROUND(M$4/Liste!M$5*Liste!M19,M$6)))","v":""},{"$f":"IF(N$4=0,\"\",IF(Liste!N19=\"\",\"\",ROUND(N$4/Liste!N$5*Liste!N19,N$6)))","v":""},{"$f":"IF(O$4=0,\"\",IF(Liste!O19=\"\",\"\",ROUND(O$4/Liste!O$5*Liste!O19,O$6)))","v":""},{"$f":"IF(P$4=0,\"\",IF(Liste!P19=\"\",\"\",ROUND(P$4/Liste!P$5*Liste!P19,P$6)))","v":""},{"$f":"IF(Q$4=0,\"\",IF(Liste!Q19=\"\",\"\",ROUND(Q$4/Liste!Q$5*Liste!Q19,Q$6)))","v":""},{"$f":"IF(R$4=0,\"\",IF(Liste!R19=\"\",\"\",ROUND(R$4/Liste!R$5*Liste!R19,R$6)))","v":""},{"$f":"IF(S$4=0,\"\",IF(Liste!S19=\"\",\"\",ROUND(S$4/Liste!S$5*Liste!S19,S$6)))","v":""},{"$f":"IF(T$4=0,\"\",IF(Liste!T19=\"\",\"\",ROUND(T$4/Liste!T$5*Liste!T19,T$6)))","v":""},{"$f":"IF(U$4=0,\"\",IF(Liste!U19=\"\",\"\",ROUND(U$4/Liste!U$5*Liste!U19,U$6)))","v":""},{"$f":"IF(V$4=0,\"\",IF(Liste!V19=\"\",\"\",ROUND(V$4/Liste!V$5*Liste!V19,V$6)))","v":100},{"$f":"IF(W$4=0,\"\",IF(Liste!W19=\"\",\"\",ROUND(W$4/Liste!W$5*Liste!W19,W$6)))","v":""},{"$f":"IF(X$4=0,\"\",IF(Liste!X19=\"\",\"\",ROUND(X$4/Liste!X$5*Liste!X19,X$6)))","v":""},{"$f":"IF(Y$4=0,\"\",IF(Liste!Y19=\"\",\"\",ROUND(Y$4/Liste!Y$5*Liste!Y19,Y$6)))","v":""},{"$f":"IF(Z$4=0,\"\",IF(Liste!Z19=\"\",\"\",ROUND(Z$4/Liste!Z$5*Liste!Z19,Z$6)))","v":""},{"$f":"IF(AA$4=0,\"\",IF(Liste!AA19=\"\",\"\",ROUND(AA$4/Liste!AA$5*Liste!AA19,AA$6)))","v":""},{"$f":"IF(AB$4=0,\"\",IF(Liste!AB19=\"\",\"\",ROUND(AB$4/Liste!AB$5*Liste!AB19,AB$6)))","v":""},{"$f":"IF(AC$4=0,\"\",IF(Liste!AC19=\"\",\"\",ROUND(AC$4/Liste!AC$5*Liste!AC19,AC$6)))","v":""},{"$f":"IF(AD$4=0,\"\",IF(Liste!AD19=\"\",\"\",ROUND(AD$4/Liste!AD$5*Liste!AD19,AD$6)))","v":""},{"$f":"IF(AE$4=0,\"\",IF(Liste!AE19=\"\",\"\",ROUND(AE$4/Liste!AE$5*Liste!AE19,AE$6)))","v":""},{"$f":"IF(AF$4=0,\"\",IF(Liste!AF19=\"\",\"\",ROUND(AF$4/Liste!AF$5*Liste!AF19,AF$6)))","v":""},{"$f":"IF(AG$4=0,\"\",IF(Liste!AG19=\"\",\"\",ROUND(AG$4/Liste!AG$5*Liste!AG19,AG$6)))","v":""},{"$f":"IF(AH$4=0,\"\",IF(Liste!AH19=\"\",\"\",ROUND(AH$4/Liste!AH$5*Liste!AH19,AH$6)))","v":""}]
[100,{"$f":"IF(Liste!B20=\"\",\"\",Liste!B20)","v":"Kakaopulver"},{"$f":"IF(Liste!C20=\"\",\"\",Liste!C20)","v":""},{"$f":"IF(Liste!D20=\"\",\"\",Liste!D20)","v":"[g]"},{"$f":"IF(E$4=0,\"\",IF(Liste!E20=\"\",\"\",ROUND(E$4/Liste!E$5*Liste!E20,E$6)))","v":""},{"$f":"IF(F$4=0,\"\",IF(Liste!F20=\"\",\"\",ROUND(F$4/Liste!F$5*Liste!F20,F$6)))","v":40},{"$f":"IF(G$4=0,\"\",IF(Liste!G20=\"\",\"\",ROUND(G$4/Liste!G$5*Liste!G20,G$6)))","v":""},{"$f":"IF(H$4=0,\"\",IF(Liste!H20=\"\",\"\",ROUND(H$4/Liste!H$5*Liste!H20,H$6)))","v":""},{"$f":"IF(I$4=0,\"\",IF(Liste!I20=\"\",\"\",ROUND(I$4/Liste!I$5*Liste!I20,I$6)))","v":""},{"$f":"IF(J$4=0,\"\",IF(Liste!J20=\"\",\"\",ROUND(J$4/Liste!J$5*Liste!J20,J$6)))","v":""},{"$f":"IF(K$4=0,\"\",IF(Liste!K20=\"\",\"\",ROUND(K$4/Liste!K$5*Liste!K20,K$6)))","v":""},{"$f":"IF(L$4=0,\"\",IF(Liste!L20=\"\",\"\",ROUND(L$4/Liste!L$5*Liste!L20,L$6)))","v":""},{"$f":"IF(M$4=0,\"\",IF(Liste!M20=\"\",\"\",ROUND(M$4/Liste!M$5*Liste!M20,M$6)))","v":""},{"$f":"IF(N$4=0,\"\",IF(Liste!N20=\"\",\"\",ROUND(N$4/Liste!N$5*Liste!N20,N$6)))","v":""},{"$f":"IF(O$4=0,\"\",IF(Liste!O20=\"\",\"\",ROUND(O$4/Liste!O$5*Liste!O20,O$6)))","v":""},{"$f":"IF(P$4=0,\"\",IF(Liste!P20=\"\",\"\",ROUND(P$4/Liste!P$5*Liste!P20,P$6)))","v":30},{"$f":"IF(Q$4=0,\"\",IF(Liste!Q20=\"\",\"\",ROUND(Q$4/Liste!Q$5*Liste!Q20,Q$6)))","v":""},{"$f":"IF(R$4=0,\"\",IF(Liste!R20=\"\",\"\",ROUND(R$4/Liste!R$5*Liste!R20,R$6)))","v":""},{"$f":"IF(S$4=0,\"\",IF(Liste!S20=\"\",\"\",ROUND(S$4/Liste!S$5*Liste!S20,S$6)))","v":""},{"$f":"IF(T$4=0,\"\",IF(Liste!T20=\"\",\"\",ROUND(T$4/Liste!T$5*Liste!T20,T$6)))","v":""},{"$f":"IF(U$4=0,\"\",IF(Liste!U20=\"\",\"\",ROUND(U$4/Liste!U$5*Liste!U20,U$6)))","v":""},{"$f":"IF(V$4=0,\"\",IF(Liste!V20=\"\",\"\",ROUND(V$4/Liste!V$5*Liste!V20,V$6)))","v":""},{"$f":"IF(W$4=0,\"\",IF(Liste!W20=\"\",\"\",ROUND(W$4/Liste!W$5*Liste!W20,W$6)))","v":""},{"$f":"IF(X$4=0,\"\",IF(Liste!X20=\"\",\"\",ROUND(X$4/Liste!X$5*Liste!X20,X$6)))","v":30},{"$f":"IF(Y$4=0,\"\",IF(Liste!Y20=\"\",\"\",ROUND(Y$4/Liste!Y$5*Liste!Y20,Y$6)))","v":""},{"$f":"IF(Z$4=0,\"\",IF(Liste!Z20=\"\",\"\",ROUND(Z$4/Liste!Z$5*Liste!Z20,Z$6)))","v":""},{"$f":"IF(AA$4=0,\"\",IF(Liste!AA20=\"\",\"\",ROUND(AA$4/Liste!AA$5*Liste!AA20,AA$6)))","v":""},{"$f":"IF(AB$4=0,\"\",IF(Liste!AB20=\"\",\"\",ROUND(AB$4/Liste!AB$5*Liste!AB20,AB$6)))","v":""},{"$f":"IF(AC$4=0,\"\",IF(Liste!AC20=\"\",\"\",ROUND(AC$4/Liste!AC$5*Liste!AC20,AC$6)))","v":""},{"$f":"IF(AD$4=0,\"\",IF(Liste!AD20=\"\",\"\",ROUND(AD$4/Liste!AD$5*Liste!AD20,AD$6)))","v":""},{"$f":"IF(AE$4=0,\"\",IF(Liste!AE20=\"\",\"\",ROUND(AE$4/Liste!AE$5*Liste!AE20,AE$6)))","v":""},{"$f":"IF(AF$4=0,\"\",IF(Liste!AF20=\"\",\"\",ROUND(AF$4/Liste!AF$5*Liste!AF20,AF$6)))","v":""},{"$f":"IF(AG$4=0,\"\",IF(Liste!AG20=\"\",\"\",ROUND(AG$4/Liste!AG$5*Liste!AG20,AG$6)))","v":""},{"$f":"IF(AH$4=0,\"\",IF(Liste!AH20=\"\",\"\",ROUND(AH$4/Liste!AH$5*Liste!AH20,AH$6)))","v":""}]
[150,{"$f":"IF(Liste!B21=\"\",\"\",Liste!B21)","v":"Speisestärke"},{"$f":"IF(Liste!C21=\"\",\"\",Liste!C21)","v":""},{"$f":"IF(Liste!D21=\"\",\"\",Liste!D21)","v":"[g]"},{"$f":"IF(E$4=0,\"\",IF(Liste!E21=\"\",\"\",ROUND(E$4/Liste!E$5*Liste!E21,E$6)))","v":""},{"$f":"IF(F$4=0,\"\",IF(Liste!F21=\"\",\"\",ROUND(F$4/Liste!F$5*Liste!F21,F$6)))","v":""},{"$f":"IF(G$4=0,\"\",IF(Liste!G21=\"\",\"\",ROUND(G$4/Liste!G$5*Liste!G21,G$6)))","v":""},{"$f":"IF(H$4=0,\"\",IF(Liste!H21=\"\",\"\",ROUND(H$4/Liste!H$5*Liste!H21,H$6)))","v":""},{"$f":"IF(I$4=0,\"\",IF(Liste!I21=\"\",\"\",ROUND(I$4/Liste!I$5*Liste!I21,I$6)))","v":""},{"$f":"IF(J$4=0,\"\",IF(Liste!J21=\"\",\"\",ROUND(J$4/Liste!J$5*Liste!J21,J$6)))","v":""},{"$f":"IF(K$4=0,\"\",IF(Liste!K21=\"\",\"\",ROUND(K$4/Liste!K$5*Liste!K21,K$6)))","v":""},{"$f":"IF(L$4=0,\"\",IF(Liste!L21=\"\",\"\",ROUND(L$4/Liste!L$5*Liste!L21,L$6)))","v":""},{"$f":"IF(M$4=0,\"\",IF(Liste!M21=\"\",\"\",ROUND(M$4/Liste!M$5*Liste!M21,M$6)))","v":""},{"$f":"IF(N$4=0,\"\",IF(Liste!N21=\"\",\"\",ROUND(N$4/Liste!N$5*Liste!N21,N$6)))","v":""},{"$f":"IF(O$4=0,\"\",IF(Liste!O21=\"\",\"\",ROUND(O$4/Liste!O$5*Liste!O21,O$6)))","v":150},{"$f":"IF(P$4=0,\"\",IF(Liste!P21=\"\",\"\",ROUND(P$4/Liste!P$5*Liste!P21,P$6)))","v":""},{"$f":"IF(Q$4=0,\"\",IF(Liste!Q21=\"\",\"\",ROUND(Q$4/Liste!Q$5*Liste!Q21,Q$6)))","v":""},{"$f":"IF(R$4=0,\"\",IF(Liste!R21=\"\",\"\",ROUND(R$4/Liste!R$5*Liste!R21,R$6)))","v":""},{"$f":"IF(S$4=0,\"\",IF(Liste!S21=\"\",\"\",ROUND(S$4/Liste!S$5*Liste!S21,S$6)))","v":""},{"$f":"IF(T$4=0,\"\",IF(Liste!T21=\"\",\"\",ROUND(T$4/Liste!T$5*Liste!T21,T$6)))","v":""},{"$f":"IF(U$4=0,\"\",IF(Liste!U21=\"\",\"\",ROUND(U$4/Liste!U$5*Liste!U21,U$6)))","v":""},{"$f":"IF(V$4=0,\"\",IF(Liste!V21=\"\",\"\",ROUND(V$4/Liste!V$5*Liste!V21,V$6)))","v":""},{"$f":"IF(W$4=0,\"\",IF(Liste!W21=\"\",\"\",ROUND(W$4/Liste!W$5*Liste!W21,W$6)))","v":""},{"$f":"IF(X$4=0,\"\",IF(Liste!X21=\"\",\"\",ROUND(X$4/Liste!X$5*Liste!X21,X$6)))","v":""},{"$f":"IF(Y$4=0,\"\",IF(Liste!Y21=\"\",\"\",ROUND(Y$4/Liste!Y$5*Liste!Y21,Y$6)))","v":""},{"$f":"IF(Z$4=0,\"\",IF(Liste!Z21=\"\",\"\",ROUND(Z$4/Liste!Z$5*Liste!Z21,Z$6)))","v":""},{"$f":"IF(AA$4=0,\"\",IF(Liste!AA21=\"\",\"\",ROUND(AA$4/Liste!AA$5*Liste!AA21,AA$6)))","v":""},{"$f":"IF(AB$4=0,\"\",IF(Liste!AB21=\"\",\"\",ROUND(AB$4/Liste!AB$5*Liste!AB21,AB$6)))","v":""},{"$f":"IF(AC$4=0,\"\",IF(Liste!AC21=\"\",\"\",ROUND(AC$4/Liste!AC$5*Liste!AC21,AC$6)))","v":""},{"$f":"IF(AD$4=0,\"\",IF(Liste!AD21=\"\",\"\",ROUND(AD$4/Liste!AD$5*Liste!AD21,AD$6)))","v":""},{"$f":"IF(AE$4=0,\"\",IF(Liste!AE21=\"\",\"\",ROUND(AE$4/Liste!AE$5*Liste!AE21,AE$6)))","v":""},{"$f":"IF(AF$4=0,\"\",IF(Liste!AF21=\"\",\"\",ROUND(AF$4/Liste!AF$5*Liste!AF21,AF$6)))","v":""},{"$f":"IF(AG$4=0,\"\",IF(Liste!AG21=\"\",\"\",ROUND(AG$4/Liste!AG$5*Liste!AG21,AG$6)))","v":""},{"$f":"IF(AH$4=0,\"\",IF(Liste!AH21=\"\",\"\",ROUND(AH$4/Liste!AH$5*Liste!AH21,AH$6)))","v":""}]
["",{"$f":"IF(Liste!B22=\"\",\"\",Liste!B22)","v":"Ahornsirup"},{"$f":"IF(Liste!C22=\"\",\"\",Liste!C22)","v":""},{"$f":"IF(Liste!D22=\"\",\"\",Liste!D22)","v":"[g]"},{"$f":"IF(E$4=0,\"\",IF(Liste!E22=\"\",\"\",ROUND(E$4/Liste!E$5*Liste!E22,E$6)))","v":""},{"$f":"IF(F$4=0,\"\",IF(Liste!F22=\"\",\"\",ROUND(F$4/Liste!F$5*Liste!F22,F$6)))","v":""},{"$f":"IF(G$4=0,\"\",IF(Liste!G22=\"\",\"\",ROUND(G$4/Liste!G$5*Liste!G22,G$6)))","v":""},{"$f":"IF(H$4=0,\"\",IF(Liste!H22=\"\",\"\",ROUND(H$4/Liste!H$5*Liste!H22,H$6)))","v":""},{"$f":"IF(I$4=0,\"\",IF(Liste!I22=\"\",\"\",ROUND(I$4/Liste!I$5*Liste!I22,I$6)))","v":""},{"$f":"IF(J$4=0,\"\",IF(Liste!J22=\"\",\"\",ROUND(J$4/Liste!J$5*Liste!J22,J$6)))","v":""},{"$f":"IF(K$4=0,\"\",IF(Liste!K22=\"\",\"\",ROUND(K$4/Liste!K$5*Liste!K22,K$6)))","v":""},{"$f":"IF(L$4=0,\"\",IF(Liste!L22=\"\",\"\",ROUND(L$4/Liste!L$5*Liste!L22,L$6)))","v":""},{"$f":"IF(M$4=0,\"\",IF(Liste!M22=\"\",\"\",ROUND(M$4/Liste!M$5*Liste!M22,M$6)))","v":""},{"$f":"IF(N$4=0,\"\",IF(Liste!N22=\"\",\"\",ROUND(N$4/Liste!N$5*Liste!N22,N$6)))","v":""},{"$f":"IF(O$4=0,\"\",IF(Liste!O22=\"\",\"\",ROUND(O$4/Liste!O$5*Liste!O22,O$6)))","v":""},{"$f":"IF(P$4=0,\"\",IF(Liste!P22=\"\",\"\",ROUND(P$4/Liste!P$5*Liste!P22,P$6)))","v":""},{"$f":"IF(Q$4=0,\"\",IF(Liste!Q22=\"\",\"\",ROUND(Q$4/Liste!Q$5*Liste!Q22,Q$6)))","v":""},{"$f":"IF(R$4=0,\"\",IF(Liste!R22=\"\",\"\",ROUND(R$4/Liste!R$5*Liste!R22,R$6)))","v":""},{"$f":"IF(S$4=0,\"\",IF(Liste!S22=\"\",\"\",ROUND(S$4/Liste!S$5*Liste!S22,S$6)))","v":""},{"$f":"IF(T$4=0,\"\",IF(Liste!T22=\"\",\"\",ROUND(T$4/Liste!T$5*Liste!T22,T$6)))","v":""},{"$f":"IF(U$4=0,\"\",IF(Liste!U22=\"\",\"\",ROUND(U$4/Liste!U$5*Liste!U22,U$6)))","v":""},{"$f":"IF(V$4=0,\"\",IF(Liste!V22=\"\",\"\",ROUND(V$4/Liste!V$5*Liste!V22,V$6)))","v":""},{"$f":"IF(W$4=0,\"\",IF(Liste!W22=\"\",\"\",ROUND(W$4/Liste!W$5*Liste!W22,W$6)))","v":""},{"$f":"IF(X$4=0,\"\",IF(Liste!X22=\"\",\"\",ROUND(X$4/Liste!X$5*Liste!X22,X$6)))","v":""},{"$f":"IF(Y$4=0,\"\",IF(Liste!Y22=\"\",\"\",ROUND(Y$4/Liste!Y$5*Liste!Y22,Y$6)))","v":""},{"$f":"IF(Z$4=0,\"\",IF(Liste!Z22=\"\",\"\",ROUND(Z$4/Liste!Z$5*Liste!Z22,Z$6)))","v":""},{"$f":"IF(AA$4=0,\"\",IF(Liste!AA22=\"\",\"\",ROUND(AA$4/Liste!AA$5*Liste!AA22,AA$6)))","v":""},{"$f":"IF(AB$4=0,\"\",IF(Liste!AB22=\"\",\"\",ROUND(AB$4/Liste!AB$5*Liste!AB22,AB$6)))","v":""},{"$f":"IF(AC$4=0,\"\",IF(Liste!AC22=\"\",\"\",ROUND(AC$4/Liste!AC$5*Liste!AC22,AC$6)))","v":""},{"$f":"IF(AD$4=0,\"\",IF(Liste!AD22=\"\",\"\",ROUND(AD$4/Liste!AD$5*Liste!AD22,AD$6)))","v":""},{"$f":"IF(AE$4=0,\"\",IF(Liste!AE22=\"\",\"\",ROUND(AE$4/Liste!AE$5*Liste!AE22,AE$6)))","v":""},{"$f":"IF(AF$4=0,\"\",IF(Liste!AF22=\"\",\"\",ROUND(AF$4/Liste!AF$5*Liste!AF22,AF$6)))","v":""},{"$f":"IF(AG$4=0,\"\",IF(Liste!AG22=\"\",\"\",ROUND(AG$4/Liste!AG$5*Liste!AG22,AG$6)))","v":""},{"$f":"IF(AH$4=0,\"\",IF(Liste!AH22=\"\",\"\",ROUND(AH$4/Liste!AH$5*Liste!AH22,AH$6)))","v":""}]
["",{"$f":"IF(Liste!B23=\"\",\"\",Liste!B23)","v":"Zitronat"},{"$f":"IF(Liste!C23=\"\",\"\",Liste!C23)","v":"gehackt"},{"$f":"IF(Liste!D23=\"\",\"\",Liste!D23)","v":"[g]"},{"$f":"IF(E$4=0,\"\",IF(Liste!E23=\"\",\"\",ROUND(E$4/Liste!E$5*Liste!E23,E$6)))","v":""},{"$f":"IF(F$4=0,\"\",IF(Liste!F23=\"\",\"\",ROUND(F$4/Liste!F$5*Liste!F23,F$6)))","v":""},{"$f":"IF(G$4=0,\"\",IF(Liste!G23=\"\",\"\",ROUND(G$4/Liste!G$5*Liste!G23,G$6)))","v":""},{"$f":"IF(H$4=0,\"\",IF(Liste!H23=\"\",\"\",ROUND(H$4/Liste!H$5*Liste!H23,H$6)))","v":""},{"$f":"IF(I$4=0,\"\",IF(Liste!I23=\"\",\"\",ROUND(I$4/Liste!I$5*Liste!I23,I$6)))","v":""},{"$f":"IF(J$4=0,\"\",IF(Liste!J23=\"\",\"\",ROUND(J$4/Liste!J$5*Liste!J23,J$6)))","v":""},{"$f":"IF(K$4=0,\"\",IF(Liste!K23=\"\",\"\",ROUND(K$4/Liste!K$5*Liste!K23,K$6)))","v":""},{"$f":"IF(L$4=0,\"\",IF(Liste!L23=\"\",\"\",ROUND(L$4/Liste!L$5*Liste!L23,L$6)))","v":""},{"$f":"IF(M$4=0,\"\",IF(Liste!M23=\"\",\"\",ROUND(M$4/Liste!M$5*Liste!M23,M$6)))","v":""},{"$f":"IF(N$4=0,\"\",IF(Liste!N23=\"\",\"\",ROUND(N$4/Liste!N$5*Liste!N23,N$6)))","v":""},{"$f":"IF(O$4=0,\"\",IF(Liste!O23=\"\",\"\",ROUND(O$4/Liste!O$5*Liste!O23,O$6)))","v":""},{"$f":"IF(P$4=0,\"\",IF(Liste!P23=\"\",\"\",ROUND(P$4/Liste!P$5*Liste!P23,P$6)))","v":""},{"$f":"IF(Q$4=0,\"\",IF(Liste!Q23=\"\",\"\",ROUND(Q$4/Liste!Q$5*Liste!Q23,Q$6)))","v":""},{"$f":"IF(R$4=0,\"\",IF(Liste!R23=\"\",\"\",ROUND(R$4/Liste!R$5*Liste!R23,R$6)))","v":""},{"$f":"IF(S$4=0,\"\",IF(Liste!S23=\"\",\"\",ROUND(S$4/Liste!S$5*Liste!S23,S$6)))","v":""},{"$f":"IF(T$4=0,\"\",IF(Liste!T23=\"\",\"\",ROUND(T$4/Liste!T$5*Liste!T23,T$6)))","v":""},{"$f":"IF(U$4=0,\"\",IF(Liste!U23=\"\",\"\",ROUND(U$4/Liste!U$5*Liste!U23,U$6)))","v":""},{"$f":"IF(V$4=0,\"\",IF(Liste!V23=\"\",\"\",ROUND(V$4/Liste!V$5*Liste!V23,V$6)))","v":""},{"$f":"IF(W$4=0,\"\",IF(Liste!W23=\"\",\"\",ROUND(W$4/Liste!W$5*Liste!W23,W$6)))","v":""},{"$f":"IF(X$4=0,\"\",IF(Liste!X23=\"\",\"\",ROUND(X$4/Liste!X$5*Liste!X23,X$6)))","v":""},{"$f":"IF(Y$4=0,\"\",IF(Liste!Y23=\"\",\"\",ROUND(Y$4/Liste!Y$5*Liste!Y23,Y$6)))","v":""},{"$f":"IF(Z$4=0,\"\",IF(Liste!Z23=\"\",\"\",ROUND(Z$4/Liste!Z$5*Liste!Z23,Z$6)))","v":""},{"$f":"IF(AA$4=0,\"\",IF(Liste!AA23=\"\",\"\",ROUND(AA$4/Liste!AA$5*Liste!AA23,AA$6)))","v":""},{"$f":"IF(AB$4=0,\"\",IF(Liste!AB23=\"\",\"\",ROUND(AB$4/Liste!AB$5*Liste!AB23,AB$6)))","v":""},{"$f":"IF(AC$4=0,\"\",IF(Liste!AC23=\"\",\"\",ROUND(AC$4/Liste!AC$5*Liste!AC23,AC$6)))","v":""},{"$f":"IF(AD$4=0,\"\",IF(Liste!AD23=\"\",\"\",ROUND(AD$4/Liste!AD$5*Liste!AD23,AD$6)))","v":""},{"$f":"IF(AE$4=0,\"\",IF(Liste!AE23=\"\",\"\",ROUND(AE$4/Liste!AE$5*Liste!AE23,AE$6)))","v":""},{"$f":"IF(AF$4=0,\"\",IF(Liste!AF23=\"\",\"\",ROUND(AF$4/Liste!AF$5*Liste!AF23,AF$6)))","v":""},{"$f":"IF(AG$4=0,\"\",IF(Liste!AG23=\"\",\"\",ROUND(AG$4/Liste!AG$5*Liste!AG23,AG$6)))","v":""},{"$f":"IF(AH$4=0,\"\",IF(Liste!AH23=\"\",\"\",ROUND(AH$4/Liste!AH$5*Liste!AH23,AH$6)))","v":""}]
["",{"$f":"IF(Liste!B24=\"\",\"\",Liste!B24)","v":"Pottasche"},{"$f":"IF(Liste!C24=\"\",\"\",Liste!C24)","v":""},{"$f":"IF(Liste!D24=\"\",\"\",Liste!D24)","v":"[g]"},{"$f":"IF(E$4=0,\"\",IF(Liste!E24=\"\",\"\",ROUND(E$4/Liste!E$5*Liste!E24,E$6)))","v":""},{"$f":"IF(F$4=0,\"\",IF(Liste!F24=\"\",\"\",ROUND(F$4/Liste!F$5*Liste!F24,F$6)))","v":""},{"$f":"IF(G$4=0,\"\",IF(Liste!G24=\"\",\"\",ROUND(G$4/Liste!G$5*Liste!G24,G$6)))","v":""},{"$f":"IF(H$4=0,\"\",IF(Liste!H24=\"\",\"\",ROUND(H$4/Liste!H$5*Liste!H24,H$6)))","v":""},{"$f":"IF(I$4=0,\"\",IF(Liste!I24=\"\",\"\",ROUND(I$4/Liste!I$5*Liste!I24,I$6)))","v":""},{"$f":"IF(J$4=0,\"\",IF(Liste!J24=\"\",\"\",ROUND(J$4/Liste!J$5*Liste!J24,J$6)))","v":""},{"$f":"IF(K$4=0,\"\",IF(Liste!K24=\"\",\"\",ROUND(K$4/Liste!K$5*Liste!K24,K$6)))","v":""},{"$f":"IF(L$4=0,\"\",IF(Liste!L24=\"\",\"\",ROUND(L$4/Liste!L$5*Liste!L24,L$6)))","v":""},{"$f":"IF(M$4=0,\"\",IF(Liste!M24=\"\",\"\",ROUND(M$4/Liste!M$5*Liste!M24,M$6)))","v":""},{"$f":"IF(N$4=0,\"\",IF(Liste!N24=\"\",\"\",ROUND(N$4/Liste!N$5*Liste!N24,N$6)))","v":""},{"$f":"IF(O$4=0,\"\",IF(Liste!O24=\"\",\"\",ROUND(O$4/Liste!O$5*Liste!O24,O$6)))","v":""},{"$f":"IF(P$4=0,\"\",IF(Liste!P24=\"\",\"\",ROUND(P$4/Liste!P$5*Liste!P24,P$6)))","v":""},{"$f":"IF(Q$4=0,\"\",IF(Liste!Q24=\"\",\"\",ROUND(Q$4/Liste!Q$5*Liste!Q24,Q$6)))","v":""},{"$f":"IF(R$4=0,\"\",IF(Liste!R24=\"\",\"\",ROUND(R$4/Liste!R$5*Liste!R24,R$6)))","v":""},{"$f":"IF(S$4=0,\"\",IF(Liste!S24=\"\",\"\",ROUND(S$4/Liste!S$5*Liste!S24,S$6)))","v":""},{"$f":"IF(T$4=0,\"\",IF(Liste!T24=\"\",\"\",ROUND(T$4/Liste!T$5*Liste!T24,T$6)))","v":""},{"$f":"IF(U$4=0,\"\",IF(Liste!U24=\"\",\"\",ROUND(U$4/Liste!U$5*Liste!U24,U$6)))","v":""},{"$f":"IF(V$4=0,\"\",IF(Liste!V24=\"\",\"\",ROUND(V$4/Liste!V$5*Liste!V24,V$6)))","v":""},{"$f":"IF(W$4=0,\"\",IF(Liste!W24=\"\",\"\",ROUND(W$4/Liste!W$5*Liste!W24,W$6)))","v":""},{"$f":"IF(X$4=0,\"\",IF(Liste!X24=\"\",\"\",ROUND(X$4/Liste!X$5*Liste!X24,X$6)))","v":""},{"$f":"IF(Y$4=0,\"\",IF(Liste!Y24=\"\",\"\",ROUND(Y$4/Liste!Y$5*Liste!Y24,Y$6)))","v":""},{"$f":"IF(Z$4=0,\"\",IF(Liste!Z24=\"\",\"\",ROUND(Z$4/Liste!Z$5*Liste!Z24,Z$6)))","v":""},{"$f":"IF(AA$4=0,\"\",IF(Liste!AA24=\"\",\"\",ROUND(AA$4/Liste!AA$5*Liste!AA24,AA$6)))","v":""},{"$f":"IF(AB$4=0,\"\",IF(Liste!AB24=\"\",\"\",ROUND(AB$4/Liste!AB$5*Liste!AB24,AB$6)))","v":""},{"$f":"IF(AC$4=0,\"\",IF(Liste!AC24=\"\",\"\",ROUND(AC$4/Liste!AC$5*Liste!AC24,AC$6)))","v":""},{"$f":"IF(AD$4=0,\"\",IF(Liste!AD24=\"\",\"\",ROUND(AD$4/Liste!AD$5*Liste!AD24,AD$6)))","v":""},{"$f":"IF(AE$4=0,\"\",IF(Liste!AE24=\"\",\"\",ROUND(AE$4/Liste!AE$5*Liste!AE24,AE$6)))","v":""},{"$f":"IF(AF$4=0,\"\",IF(Liste!AF24=\"\",\"\",ROUND(AF$4/Liste!AF$5*Liste!AF24,AF$6)))","v":""},{"$f":"IF(AG$4=0,\"\",IF(Liste!AG24=\"\",\"\",ROUND(AG$4/Liste!AG$5*Liste!AG24,AG$6)))","v":""},{"$f":"IF(AH$4=0,\"\",IF(Liste!AH24=\"\",\"\",ROUND(AH$4/Liste!AH$5*Liste!AH24,AH$6)))","v":""}]
[150,{"$f":"IF(Liste!B25=\"\",\"\",Liste!B25)","v":"Blockschokolade"},{"$f":"IF(Liste!C25=\"\",\"\",Liste!C25)","v":""},{"$f":"IF(Liste!D25=\"\",\"\",Liste!D25)","v":"[g]"},{"$f":"IF(E$4=0,\"\",IF(Liste!E25=\"\",\"\",ROUND(E$4/Liste!E$5*Liste!E25,E$6)))","v":""},{"$f":"IF(F$4=0,\"\",IF(Liste!F25=\"\",\"\",ROUND(F$4/Liste!F$5*Liste!F25,F$6)))","v":""},{"$f":"IF(G$4=0,\"\",IF(Liste!G25=\"\",\"\",ROUND(G$4/Liste!G$5*Liste!G25,G$6)))","v":""},{"$f":"IF(H$4=0,\"\",IF(Liste!H25=\"\",\"\",ROUND(H$4/Liste!H$5*Liste!H25,H$6)))","v":""},{"$f":"IF(I$4=0,\"\",IF(Liste!I25=\"\",\"\",ROUND(I$4/Liste!I$5*Liste!I25,I$6)))","v":""},{"$f":"IF(J$4=0,\"\",IF(Liste!J25=\"\",\"\",ROUND(J$4/Liste!J$5*Liste!J25,J$6)))","v":""},{"$f":"IF(K$4=0,\"\",IF(Liste!K25=\"\",\"\",ROUND(K$4/Liste!K$5*Liste!K25,K$6)))","v":""},{"$f":"IF(L$4=0,\"\",IF(Liste!L25=\"\",\"\",ROUND(L$4/Liste!L$5*Liste!L25,L$6)))","v":""},{"$f":"IF(M$4=0,\"\",IF(Liste!M25=\"\",\"\",ROUND(M$4/Liste!M$5*Liste!M25,M$6)))","v":""},{"$f":"IF(N$4=0,\"\",IF(Liste!N25=\"\",\"\",ROUND(N$4/Liste!N$5*Liste!N25,N$6)))","v":""},{"$f":"IF(O$4=0,\"\",IF(Liste!O25=\"\",\"\",ROUND(O$4/Liste!O$5*Liste!O25,O$6)))","v":""},{"$f":"IF(P$4=0,\"\",IF(Liste!P25=\"\",\"\",ROUND(P$4/Liste!P$5*Liste!P25,P$6)))","v":150},{"$f":"IF(Q$4=0,\"\",IF(Liste!Q25=\"\",\"\",ROUND(Q$4/Liste!Q$5*Liste!Q25,Q$6)))","v":""},{"$f":"IF(R$4=0,\"\",IF(Liste!R25=\"\",\"\",ROUND(R$4/Liste!R$5*Liste!R25,R$6)))","v":""},{"$f":"IF(S$4=0,\"\",IF(Liste!S25=\"\",\"\",ROUND(S$4/Liste!S$5*Liste!S25,S$6)))","v":""},{"$f":"IF(T$4=0,\"\",IF(Liste!T25=\"\",\"\",ROUND(T$4/Liste!T$5*Liste!T25,T$6)))","v":""},{"$f":"IF(U$4=0,\"\",IF(Liste!U25=\"\",\"\",ROUND(U$4/Liste!U$5*Liste!U25,U$6)))","v":""},{"$f":"IF(V$4=0,\"\",IF(Liste!V25=\"\",\"\",ROUND(V$4/Liste!V$5*Liste!V25,V$6)))","v":""},{"$f":"IF(W$4=0,\"\",IF(Liste!W25=\"\",\"\",ROUND(W$4/Liste!W$5*Liste!W25,W$6)))","v":""},{"$f":"IF(X$4=0,\"\",IF(Liste!X25=\"\",\"\",ROUND(X$4/Liste!X$5*Liste!X25,X$6)))","v":""},{"$f":"IF(Y$4=0,\"\",IF(Liste!Y25=\"\",\"\",ROUND(Y$4/Liste!Y$5*Liste!Y25,Y$6)))","v":""},{"$f":"IF(Z$4=0,\"\",IF(Liste!Z25=\"\",\"\",ROUND(Z$4/Liste!Z$5*Liste!Z25,Z$6)))","v":""},{"$f":"IF(AA$4=0,\"\",IF(Liste!AA25=\"\",\"\",ROUND(AA$4/Liste!AA$5*Liste!AA25,AA$6)))","v":""},{"$f":"IF(AB$4=0,\"\",IF(Liste!AB25=\"\",\"\",ROUND(AB$4/Liste!AB$5*Liste!AB25,AB$6)))","v":""},{"$f":"IF(AC$4=0,\"\",IF(Liste!AC25=\"\",\"\",ROUND(AC$4/Liste!AC$5*Liste!AC25,AC$6)))","v":""},{"$f":"IF(AD$4=0,\"\",IF(Liste!AD25=\"\",\"\",ROUND(AD$4/Liste!AD$5*Liste!AD25,AD$6)))","v":""},{"$f":"IF(AE$4=0,\"\",IF(Liste!AE25=\"\",\"\",ROUND(AE$4/Liste!AE$5*Liste!AE25,AE$6)))","v":""},{"$f":"IF(AF$4=0,\"\",IF(Liste!AF25=\"\",\"\",ROUND(AF$4/Liste!AF$5*Liste!AF25,AF$6)))","v":""},{"$f":"IF(AG$4=0,\"\",IF(Liste!AG25=\"\",\"\",ROUND(AG$4/Liste!AG$5*Liste!AG25,AG$6)))","v":""},{"$f":"IF(AH$4=0,\"\",IF(Liste!AH25=\"\",\"\",ROUND(AH$4/Liste!AH$5*Liste!AH25,AH$6)))","v":""}]
[125,{"$f":"IF(Liste!B26=\"\",\"\",Liste!B26)","v":"Marmelade"},{"$f":"IF(Liste!C26=\"\",\"\",Liste!C26)","v":""},{"$f":"IF(Liste!D26=\"\",\"\",Liste!D26)","v":"[g]"},{"$f":"IF(E$4=0,\"\",IF(Liste!E26=\"\",\"\",ROUND(E$4/Liste!E$5*Liste!E26,E$6)))","v":""},{"$f":"IF(F$4=0,\"\",IF(Liste!F26=\"\",\"\",ROUND(F$4/Liste!F$5*Liste!F26,F$6)))","v":""},{"$f":"IF(G$4=0,\"\",IF(Liste!G26=\"\",\"\",ROUND(G$4/Liste!G$5*Liste!G26,G$6)))","v":""},{"$f":"IF(H$4=0,\"\",IF(Liste!H26=\"\",\"\",ROUND(H$4/Liste!H$5*Liste!H26,H$6)))","v":""},{"$f":"IF(I$4=0,\"\",IF(Liste!I26=\"\",\"\",ROUND(I$4/Liste!I$5*Liste!I26,I$6)))","v":""},{"$f":"IF(J$4=0,\"\",IF(Liste!J26=\"\",\"\",ROUND(J$4/Liste!J$5*Liste!J26,J$6)))","v":""},{"$f":"IF(K$4=0,\"\",IF(Liste!K26=\"\",\"\",ROUND(K$4/Liste!K$5*Liste!K26,K$6)))","v":""},{"$f":"IF(L$4=0,\"\",IF(Liste!L26=\"\",\"\",ROUND(L$4/Liste!L$5*Liste!L26,L$6)))","v":""},{"$f":"IF(M$4=0,\"\",IF(Liste!M26=\"\",\"\",ROUND(M$4/Liste!M$5*Liste!M26,M$6)))","v":""},{"$f":"IF(N$4=0,\"\",IF(Liste!N26=\"\",\"\",ROUND(N$4/Liste!N$5*Liste!N26,N$6)))","v":""},{"$f":"IF(O$4=0,\"\",IF(Liste!O26=\"\",\"\",ROUND(O$4/Liste!O$5*Liste!O26,O$6)))","v":""},{"$f":"IF(P$4=0,\"\",IF(Liste!P26=\"\",\"\",ROUND(P$4/Liste!P$5*Liste!P26,P$6)))","v":""},{"$f":"IF(Q$4=0,\"\",IF(Liste!Q26=\"\",\"\",ROUND(Q$4/Liste!Q$5*Liste!Q26,Q$6)))","v":""},{"$f":"IF(R$4=0,\"\",IF(Liste!R26=\"\",\"\",ROUND(R$4/Liste!R$5*Liste!R26,R$6)))","v":""},{"$f":"IF(S$4=0,\"\",IF(Liste!S26=\"\",\"\",ROUND(S$4/Liste!S$5*Liste!S26,S$6)))","v":""},{"$f":"IF(T$4=0,\"\",IF(Liste!T26=\"\",\"\",ROUND(T$4/Liste!T$5*Liste!T26,T$6)))","v":""},{"$f":"IF(U$4=0,\"\",IF(Liste!U26=\"\",\"\",ROUND(U$4/Liste!U$5*Liste!U26,U$6)))","v":""},{"$f":"IF(V$4=0,\"\",IF(Liste!V26=\"\",\"\",ROUND(V$4/Liste!V$5*Liste!V26,V$6)))","v":125},{"$f":"IF(W$4=0,\"\",IF(Liste!W26=\"\",\"\",ROUND(W$4/Liste!W$5*Liste!W26,W$6)))","v":""},{"$f":"IF(X$4=0,\"\",IF(Liste!X26=\"\",\"\",ROUND(X$4/Liste!X$5*Liste!X26,X$6)))","v":""},{"$f":"IF(Y$4=0,\"\",IF(Liste!Y26=\"\",\"\",ROUND(Y$4/Liste!Y$5*Liste!Y26,Y$6)))","v":""},{"$f":"IF(Z$4=0,\"\",IF(Liste!Z26=\"\",\"\",ROUND(Z$4/Liste!Z$5*Liste!Z26,Z$6)))","v":""},{"$f":"IF(AA$4=0,\"\",IF(Liste!AA26=\"\",\"\",ROUND(AA$4/Liste!AA$5*Liste!AA26,AA$6)))","v":""},{"$f":"IF(AB$4=0,\"\",IF(Liste!AB26=\"\",\"\",ROUND(AB$4/Liste!AB$5*Liste!AB26,AB$6)))","v":""},{"$f":"IF(AC$4=0,\"\",IF(Liste!AC26=\"\",\"\",ROUND(AC$4/Liste!AC$5*Liste!AC26,AC$6)))","v":""},{"$f":"IF(AD$4=0,\"\",IF(Liste!AD26=\"\",\"\",ROUND(AD$4/Liste!AD$5*Liste!AD26,AD$6)))","v":""},{"$f":"IF(AE$4=0,\"\",IF(Liste!AE26=\"\",\"\",ROUND(AE$4/Liste!AE$5*Liste!AE26,AE$6)))","v":""},{"$f":"IF(AF$4=0,\"\",IF(Liste!AF26=\"\",\"\",ROUND(AF$4/Liste!AF$5*Liste!AF26,AF$6)))","v":""},{"$f":"IF(AG$4=0,\"\",IF(Liste!AG26=\"\",\"\",ROUND(AG$4/Liste!AG$5*Liste!AG26,AG$6)))","v":""},{"$f":"IF(AH$4=0,\"\",IF(Liste!AH26=\"\",\"\",ROUND(AH$4/Liste!AH$5*Liste!AH26,AH$6)))","v":""}]
["",{"$f":"IF(Liste!B27=\"\",\"\",Liste!B27)","v":"Nüsse"},{"$f":"IF(Liste!C27=\"\",\"\",Liste!C27)","v":"gerieben"},{"$f":"IF(Liste!D27=\"\",\"\",Liste!D27)","v":"[g]"},{"$f":"IF(E$4=0,\"\",IF(Liste!E27=\"\",\"\",ROUND(E$4/Liste!E$5*Liste!E27,E$6)))","v":""},{"$f":"IF(F$4=0,\"\",IF(Liste!F27=\"\",\"\",ROUND(F$4/Liste!F$5*Liste!F27,F$6)))","v":""},{"$f":"IF(G$4=0,\"\",IF(Liste!G27=\"\",\"\",ROUND(G$4/Liste!G$5*Liste!G27,G$6)))","v":""},{"$f":"IF(H$4=0,\"\",IF(Liste!H27=\"\",\"\",ROUND(H$4/Liste!H$5*Liste!H27,H$6)))","v":""},{"$f":"IF(I$4=0,\"\",IF(Liste!I27=\"\",\"\",ROUND(I$4/Liste!I$5*Liste!I27,I$6)))","v":""},{"$f":"IF(J$4=0,\"\",IF(Liste!J27=\"\",\"\",ROUND(J$4/Liste!J$5*Liste!J27,J$6)))","v":""},{"$f":"IF(K$4=0,\"\",IF(Liste!K27=\"\",\"\",ROUND(K$4/Liste!K$5*Liste!K27,K$6)))","v":""},{"$f":"IF(L$4=0,\"\",IF(Liste!L27=\"\",\"\",ROUND(L$4/Liste!L$5*Liste!L27,L$6)))","v":""},{"$f":"IF(M$4=0,\"\",IF(Liste!M27=\"\",\"\",ROUND(M$4/Liste!M$5*Liste!M27,M$6)))","v":""},{"$f":"IF(N$4=0,\"\",IF(Liste!N27=\"\",\"\",ROUND(N$4/Liste!N$5*Liste!N27,N$6)))","v":""},{"$f":"IF(O$4=0,\"\",IF(Liste!O27=\"\",\"\",ROUND(O$4/Liste!O$5*Liste!O27,O$6)))","v":""},{"$f":"IF(P$4=0,\"\",IF(Liste!P27=\"\",\"\",ROUND(P$4/Liste!P$5*Liste!P27,P$6)))","v":""},{"$f":"IF(Q$4=0,\"\",IF(Liste!Q27=\"\",\"\",ROUND(Q$4/Liste!Q$5*Liste!Q27,Q$6)))","v":""},{"$f":"IF(R$4=0,\"\",IF(Liste!R27=\"\",\"\",ROUND(R$4/Liste!R$5*Liste!R27,R$6)))","v":""},{"$f":"IF(S$4=0,\"\",IF(Liste!S27=\"\",\"\",ROUND(S$4/Liste!S$5*Liste!S27,S$6)))","v":""},{"$f":"IF(T$4=0,\"\",IF(Liste!T27=\"\",\"\",ROUND(T$4/Liste!T$5*Liste!T27,T$6)))","v":""},{"$f":"IF(U$4=0,\"\",IF(Liste!U27=\"\",\"\",ROUND(U$4/Liste!U$5*Liste!U27,U$6)))","v":""},{"$f":"IF(V$4=0,\"\",IF(Liste!V27=\"\",\"\",ROUND(V$4/Liste!V$5*Liste!V27,V$6)))","v":""},{"$f":"IF(W$4=0,\"\",IF(Liste!W27=\"\",\"\",ROUND(W$4/Liste!W$5*Liste!W27,W$6)))","v":""},{"$f":"IF(X$4=0,\"\",IF(Liste!X27=\"\",\"\",ROUND(X$4/Liste!X$5*Liste!X27,X$6)))","v":""},{"$f":"IF(Y$4=0,\"\",IF(Liste!Y27=\"\",\"\",ROUND(Y$4/Liste!Y$5*Liste!Y27,Y$6)))","v":""},{"$f":"IF(Z$4=0,\"\",IF(Liste!Z27=\"\",\"\",ROUND(Z$4/Liste!Z$5*Liste!Z27,Z$6)))","v":""},{"$f":"IF(AA$4=0,\"\",IF(Liste!AA27=\"\",\"\",ROUND(AA$4/Liste!AA$5*Liste!AA27,AA$6)))","v":""},{"$f":"IF(AB$4=0,\"\",IF(Liste!AB27=\"\",\"\",ROUND(AB$4/Liste!AB$5*Liste!AB27,AB$6)))","v":""},{"$f":"IF(AC$4=0,\"\",IF(Liste!AC27=\"\",\"\",ROUND(AC$4/Liste!AC$5*Liste!AC27,AC$6)))","v":""},{"$f":"IF(AD$4=0,\"\",IF(Liste!AD27=\"\",\"\",ROUND(AD$4/Liste!AD$5*Liste!AD27,AD$6)))","v":""},{"$f":"IF(AE$4=0,\"\",IF(Liste!AE27=\"\",\"\",ROUND(AE$4/Liste!AE$5*Liste!AE27,AE$6)))","v":""},{"$f":"IF(AF$4=0,\"\",IF(Liste!AF27=\"\",\"\",ROUND(AF$4/Liste!AF$5*Liste!AF27,AF$6)))","v":""},{"$f":"IF(AG$4=0,\"\",IF(Liste!AG27=\"\",\"\",ROUND(AG$4/Liste!AG$5*Liste!AG27,AG$6)))","v":""},{"$f":"IF(AH$4=0,\"\",IF(Liste!AH27=\"\",\"\",ROUND(AH$4/Liste!AH$5*Liste!AH27,AH$6)))","v":""}]
["",{"$f":"IF(Liste!B28=\"\",\"\",Liste!B28)","v":"Orangeat"},{"$f":"IF(Liste!C28=\"\",\"\",Liste!C28)","v":"gehackt"},{"$f":"IF(Liste!D28=\"\",\"\",Liste!D28)","v":"[g]"},{"$f":"IF(E$4=0,\"\",IF(Liste!E28=\"\",\"\",ROUND(E$4/Liste!E$5*Liste!E28,E$6)))","v":""},{"$f":"IF(F$4=0,\"\",IF(Liste!F28=\"\",\"\",ROUND(F$4/Liste!F$5*Liste!F28,F$6)))","v":""},{"$f":"IF(G$4=0,\"\",IF(Liste!G28=\"\",\"\",ROUND(G$4/Liste!G$5*Liste!G28,G$6)))","v":""},{"$f":"IF(H$4=0,\"\",IF(Liste!H28=\"\",\"\",ROUND(H$4/Liste!H$5*Liste!H28,H$6)))","v":""},{"$f":"IF(I$4=0,\"\",IF(Liste!I28=\"\",\"\",ROUND(I$4/Liste!I$5*Liste!I28,I$6)))","v":""},{"$f":"IF(J$4=0,\"\",IF(Liste!J28=\"\",\"\",ROUND(J$4/Liste!J$5*Liste!J28,J$6)))","v":""},{"$f":"IF(K$4=0,\"\",IF(Liste!K28=\"\",\"\",ROUND(K$4/Liste!K$5*Liste!K28,K$6)))","v":""},{"$f":"IF(L$4=0,\"\",IF(Liste!L28=\"\",\"\",ROUND(L$4/Liste!L$5*Liste!L28,L$6)))","v":""},{"$f":"IF(M$4=0,\"\",IF(Liste!M28=\"\",\"\",ROUND(M$4/Liste!M$5*Liste!M28,M$6)))","v":""},{"$f":"IF(N$4=0,\"\",IF(Liste!N28=\"\",\"\",ROUND(N$4/Liste!N$5*Liste!N28,N$6)))","v":""},{"$f":"IF(O$4=0,\"\",IF(Liste!O28=\"\",\"\",ROUND(O$4/Liste!O$5*Liste!O28,O$6)))","v":""},{"$f":"IF(P$4=0,\"\",IF(Liste!P28=\"\",\"\",ROUND(P$4/Liste!P$5*Liste!P28,P$6)))","v":""},{"$f":"IF(Q$4=0,\"\",IF(Liste!Q28=\"\",\"\",ROUND(Q$4/Liste!Q$5*Liste!Q28,Q$6)))","v":""},{"$f":"IF(R$4=0,\"\",IF(Liste!R28=\"\",\"\",ROUND(R$4/Liste!R$5*Liste!R28,R$6)))","v":""},{"$f":"IF(S$4=0,\"\",IF(Liste!S28=\"\",\"\",ROUND(S$4/Liste!S$5*Liste!S28,S$6)))","v":""},{"$f":"IF(T$4=0,\"\",IF(Liste!T28=\"\",\"\",ROUND(T$4/Liste!T$5*Liste!T28,T$6)))","v":""},{"$f":"IF(U$4=0,\"\",IF(Liste!U28=\"\",\"\",ROUND(U$4/Liste!U$5*Liste!U28,U$6)))","v":""},{"$f":"IF(V$4=0,\"\",IF(Liste!V28=\"\",\"\",ROUND(V$4/Liste!V$5*Liste!V28,V$6)))","v":""},{"$f":"IF(W$4=0,\"\",IF(Liste!W28=\"\",\"\",ROUND(W$4/Liste!W$5*Liste!W28,W$6)))","v":""},{"$f":"IF(X$4=0,\"\",IF(Liste!X28=\"\",\"\",ROUND(X$4/Liste!X$5*Liste!X28,X$6)))","v":""},{"$f":"IF(Y$4=0,\"\",IF(Liste!Y28=\"\",\"\",ROUND(Y$4/Liste!Y$5*Liste!Y28,Y$6)))","v":""},{"$f":"IF(Z$4=0,\"\",IF(Liste!Z28=\"\",\"\",ROUND(Z$4/Liste!Z$5*Liste!Z28,Z$6)))","v":""},{"$f":"IF(AA$4=0,\"\",IF(Liste!AA28=\"\",\"\",ROUND(AA$4/Liste!AA$5*Liste!AA28,AA$6)))","v":""},{"$f":"IF(AB$4=0,\"\",IF(Liste!AB28=\"\",\"\",ROUND(AB$4/Liste!AB$5*Liste!AB28,AB$6)))","v":""},{"$f":"IF(AC$4=0,\"\",IF(Liste!AC28=\"\",\"\",ROUND(AC$4/Liste!AC$5*Liste!AC28,AC$6)))","v":""},{"$f":"IF(AD$4=0,\"\",IF(Liste!AD28=\"\",\"\",ROUND(AD$4/Liste!AD$5*Liste!AD28,AD$6)))","v":""},{"$f":"IF(AE$4=0,\"\",IF(Liste!AE28=\"\",\"\",ROUND(AE$4/Liste!AE$5*Liste!AE28,AE$6)))","v":""},{"$f":"IF(AF$4=0,\"\",IF(Liste!AF28=\"\",\"\",ROUND(AF$4/Liste!AF$5*Liste!AF28,AF$6)))","v":""},{"$f":"IF(AG$4=0,\"\",IF(Liste!AG28=\"\",\"\",ROUND(AG$4/Liste!AG$5*Liste!AG28,AG$6)))","v":""},{"$f":"IF(AH$4=0,\"\",IF(Liste!AH28=\"\",\"\",ROUND(AH$4/Liste!AH$5*Liste!AH28,AH$6)))","v":""}]
[330,{"$f":"IF(Liste!B29=\"\",\"\",Liste!B29)","v":"Kurvertüre"},{"$f":"IF(Liste!C29=\"\",\"\",Liste!C29)","v":""},{"$f":"IF(Liste!D29=\"\",\"\",Liste!D29)","v":"[g]"},{"$f":"IF(E$4=0,\"\",IF(Liste!E29=\"\",\"\",ROUND(E$4/Liste!E$5*Liste!E29,E$6)))","v":""},{"$f":"IF(F$4=0,\"\",IF(Liste!F29=\"\",\"\",ROUND(F$4/Liste!F$5*Liste!F29,F$6)))","v":""},{"$f":"IF(G$4=0,\"\",IF(Liste!G29=\"\",\"\",ROUND(G$4/Liste!G$5*Liste!G29,G$6)))","v":""},{"$f":"IF(H$4=0,\"\",IF(Liste!H29=\"\",\"\",ROUND(H$4/Liste!H$5*Liste!H29,H$6)))","v":""},{"$f":"IF(I$4=0,\"\",IF(Liste!I29=\"\",\"\",ROUND(I$4/Liste!I$5*Liste!I29,I$6)))","v":""},{"$f":"IF(J$4=0,\"\",IF(Liste!J29=\"\",\"\",ROUND(J$4/Liste!J$5*Liste!J29,J$6)))","v":""},{"$f":"IF(K$4=0,\"\",IF(Liste!K29=\"\",\"\",ROUND(K$4/Liste!K$5*Liste!K29,K$6)))","v":""},{"$f":"IF(L$4=0,\"\",IF(Liste!L29=\"\",\"\",ROUND(L$4/Liste!L$5*Liste!L29,L$6)))","v":100},{"$f":"IF(M$4=0,\"\",IF(Liste!M29=\"\",\"\",ROUND(M$4/Liste!M$5*Liste!M29,M$6)))","v":""},{"$f":"IF(N$4=0,\"\",IF(Liste!N29=\"\",\"\",ROUND(N$4/Liste!N$5*Liste!N29,N$6)))","v":""},{"$f":"IF(O$4=0,\"\",IF(Liste!O29=\"\",\"\",ROUND(O$4/Liste!O$5*Liste!O29,O$6)))","v":150},{"$f":"IF(P$4=0,\"\",IF(Liste!P29=\"\",\"\",ROUND(P$4/Liste!P$5*Liste!P29,P$6)))","v":""},{"$f":"IF(Q$4=0,\"\",IF(Liste!Q29=\"\",\"\",ROUND(Q$4/Liste!Q$5*Liste!Q29,Q$6)))","v":""},{"$f":"IF(R$4=0,\"\",IF(Liste!R29=\"\",\"\",ROUND(R$4/Liste!R$5*Liste!R29,R$6)))","v":""},{"$f":"IF(S$4=0,\"\",IF(Liste!S29=\"\",\"\",ROUND(S$4/Liste!S$5*Liste!S29,S$6)))","v":80},{"$f":"IF(T$4=0,\"\",IF(Liste!T29=\"\",\"\",ROUND(T$4/Liste!T$5*Liste!T29,T$6)))","v":""},{"$f":"IF(U$4=0,\"\",IF(Liste!U29=\"\",\"\",ROUND(U$4/Liste!U$5*Liste!U29,U$6)))","v":""},{"$f":"IF(V$4=0,\"\",IF(Liste!V29=\"\",\"\",ROUND(V$4/Liste!V$5*Liste!V29,V$6)))","v":""},{"$f":"IF(W$4=0,\"\",IF(Liste!W29=\"\",\"\",ROUND(W$4/Liste!W$5*Liste!W29,W$6)))","v":""},{"$f":"IF(X$4=0,\"\",IF(Liste!X29=\"\",\"\",ROUND(X$4/Liste!X$5*Liste!X29,X$6)))","v":""},{"$f":"IF(Y$4=0,\"\",IF(Liste!Y29=\"\",\"\",ROUND(Y$4/Liste!Y$5*Liste!Y29,Y$6)))","v":""},{"$f":"IF(Z$4=0,\"\",IF(Liste!Z29=\"\",\"\",ROUND(Z$4/Liste!Z$5*Liste!Z29,Z$6)))","v":""},{"$f":"IF(AA$4=0,\"\",IF(Liste!AA29=\"\",\"\",ROUND(AA$4/Liste!AA$5*Liste!AA29,AA$6)))","v":""},{"$f":"IF(AB$4=0,\"\",IF(Liste!AB29=\"\",\"\",ROUND(AB$4/Liste!AB$5*Liste!AB29,AB$6)))","v":""},{"$f":"IF(AC$4=0,\"\",IF(Liste!AC29=\"\",\"\",ROUND(AC$4/Liste!AC$5*Liste!AC29,AC$6)))","v":""},{"$f":"IF(AD$4=0,\"\",IF(Liste!AD29=\"\",\"\",ROUND(AD$4/Liste!AD$5*Liste!AD29,AD$6)))","v":""},{"$f":"IF(AE$4=0,\"\",IF(Liste!AE29=\"\",\"\",ROUND(AE$4/Liste!AE$5*Liste!AE29,AE$6)))","v":""},{"$f":"IF(AF$4=0,\"\",IF(Liste!AF29=\"\",\"\",ROUND(AF$4/Liste!AF$5*Liste!AF29,AF$6)))","v":""},{"$f":"IF(AG$4=0,\"\",IF(Liste!AG29=\"\",\"\",ROUND(AG$4/Liste!AG$5*Liste!AG29,AG$6)))","v":""},{"$f":"IF(AH$4=0,\"\",IF(Liste!AH29=\"\",\"\",ROUND(AH$4/Liste!AH$5*Liste!AH29,AH$6)))","v":""}]
[200,{"$f":"IF(Liste!B30=\"\",\"\",Liste!B30)","v":"Haselnusmus"},{"$f":"IF(Liste!C30=\"\",\"\",Liste!C30)","v":""},{"$f":"IF(Liste!D30=\"\",\"\",Liste!D30)","v":"[g]"},{"$f":"IF(E$4=0,\"\",IF(Liste!E30=\"\",\"\",ROUND(E$4/Liste!E$5*Liste!E30,E$6)))","v":""},{"$f":"IF(F$4=0,\"\",IF(Liste!F30=\"\",\"\",ROUND(F$4/Liste!F$5*Liste!F30,F$6)))","v":""},{"$f":"IF(G$4=0,\"\",IF(Liste!G30=\"\",\"\",ROUND(G$4/Liste!G$5*Liste!G30,G$6)))","v":""},{"$f":"IF(H$4=0,\"\",IF(Liste!H30=\"\",\"\",ROUND(H$4/Liste!H$5*Liste!H30,H$6)))","v":""},{"$f":"IF(I$4=0,\"\",IF(Liste!I30=\"\",\"\",ROUND(I$4/Liste!I$5*Liste!I30,I$6)))","v":""},{"$f":"IF(J$4=0,\"\",IF(Liste!J30=\"\",\"\",ROUND(J$4/Liste!J$5*Liste!J30,J$6)))","v":""},{"$f":"IF(K$4=0,\"\",IF(Liste!K30=\"\",\"\",ROUND(K$4/Liste!K$5*Liste!K30,K$6)))","v":200},{"$f":"IF(L$4=0,\"\",IF(Liste!L30=\"\",\"\",ROUND(L$4/Liste!L$5*Liste!L30,L$6)))","v":""},{"$f":"IF(M$4=0,\"\",IF(Liste!M30=\"\",\"\",ROUND(M$4/Liste!M$5*Liste!M30,M$6)))","v":""},{"$f":"IF(N$4=0,\"\",IF(Liste!N30=\"\",\"\",ROUND(N$4/Liste!N$5*Liste!N30,N$6)))","v":""},{"$f":"IF(O$4=0,\"\",IF(Liste!O30=\"\",\"\",ROUND(O$4/Liste!O$5*Liste!O30,O$6)))","v":""},{"$f":"IF(P$4=0,\"\",IF(Liste!P30=\"\",\"\",ROUND(P$4/Liste!P$5*Liste!P30,P$6)))","v":""},{"$f":"IF(Q$4=0,\"\",IF(Liste!Q30=\"\",\"\",ROUND(Q$4/Liste!Q$5*Liste!Q30,Q$6)))","v":""},{"$f":"IF(R$4=0,\"\",IF(Liste!R30=\"\",\"\",ROUND(R$4/Liste!R$5*Liste!R30,R$6)))","v":""},{"$f":"IF(S$4=0,\"\",IF(Liste!S30=\"\",\"\",ROUND(S$4/Liste!S$5*Liste!S30,S$6)))","v":""},{"$f":"IF(T$4=0,\"\",IF(Liste!T30=\"\",\"\",ROUND(T$4/Liste!T$5*Liste!T30,T$6)))","v":""},{"$f":"IF(U$4=0,\"\",IF(Liste!U30=\"\",\"\",ROUND(U$4/Liste!U$5*Liste!U30,U$6)))","v":""},{"$f":"IF(V$4=0,\"\",IF(Liste!V30=\"\",\"\",ROUND(V$4/Liste!V$5*Liste!V30,V$6)))","v":""},{"$f":"IF(W$4=0,\"\",IF(Liste!W30=\"\",\"\",ROUND(W$4/Liste!W$5*Liste!W30,W$6)))","v":""},{"$f":"IF(X$4=0,\"\",IF(Liste!X30=\"\",\"\",ROUND(X$4/Liste!X$5*Liste!X30,X$6)))","v":""},{"$f":"IF(Y$4=0,\"\",IF(Liste!Y30=\"\",\"\",ROUND(Y$4/Liste!Y$5*Liste!Y30,Y$6)))","v":""},{"$f":"IF(Z$4=0,\"\",IF(Liste!Z30=\"\",\"\",ROUND(Z$4/Liste!Z$5*Liste!Z30,Z$6)))","v":""},{"$f":"IF(AA$4=0,\"\",IF(Liste!AA30=\"\",\"\",ROUND(AA$4/Liste!AA$5*Liste!AA30,AA$6)))","v":""},{"$f":"IF(AB$4=0,\"\",IF(Liste!AB30=\"\",\"\",ROUND(AB$4/Liste!AB$5*Liste!AB30,AB$6)))","v":""},{"$f":"IF(AC$4=0,\"\",IF(Liste!AC30=\"\",\"\",ROUND(AC$4/Liste!AC$5*Liste!AC30,AC$6)))","v":""},{"$f":"IF(AD$4=0,\"\",IF(Liste!AD30=\"\",\"\",ROUND(AD$4/Liste!AD$5*Liste!AD30,AD$6)))","v":""},{"$f":"IF(AE$4=0,\"\",IF(Liste!AE30=\"\",\"\",ROUND(AE$4/Liste!AE$5*Liste!AE30,AE$6)))","v":""},{"$f":"IF(AF$4=0,\"\",IF(Liste!AF30=\"\",\"\",ROUND(AF$4/Liste!AF$5*Liste!AF30,AF$6)))","v":""},{"$f":"IF(AG$4=0,\"\",IF(Liste!AG30=\"\",\"\",ROUND(AG$4/Liste!AG$5*Liste!AG30,AG$6)))","v":""},{"$f":"IF(AH$4=0,\"\",IF(Liste!AH30=\"\",\"\",ROUND(AH$4/Liste!AH$5*Liste!AH30,AH$6)))","v":""}]
[150,{"$f":"IF(Liste!B31=\"\",\"\",Liste!B31)","v":"Sucanat"},{"$f":"IF(Liste!C31=\"\",\"\",Liste!C31)","v":""},{"$f":"IF(Liste!D31=\"\",\"\",Liste!D31)","v":"[g]"},{"$f":"IF(E$4=0,\"\",IF(Liste!E31=\"\",\"\",ROUND(E$4/Liste!E$5*Liste!E31,E$6)))","v":""},{"$f":"IF(F$4=0,\"\",IF(Liste!F31=\"\",\"\",ROUND(F$4/Liste!F$5*Liste!F31,F$6)))","v":""},{"$f":"IF(G$4=0,\"\",IF(Liste!G31=\"\",\"\",ROUND(G$4/Liste!G$5*Liste!G31,G$6)))","v":""},{"$f":"IF(H$4=0,\"\",IF(Liste!H31=\"\",\"\",ROUND(H$4/Liste!H$5*Liste!H31,H$6)))","v":""},{"$f":"IF(I$4=0,\"\",IF(Liste!I31=\"\",\"\",ROUND(I$4/Liste!I$5*Liste!I31,I$6)))","v":""},{"$f":"IF(J$4=0,\"\",IF(Liste!J31=\"\",\"\",ROUND(J$4/Liste!J$5*Liste!J31,J$6)))","v":""},{"$f":"IF(K$4=0,\"\",IF(Liste!K31=\"\",\"\",ROUND(K$4/Liste!K$5*Liste!K31,K$6)))","v":150},{"$f":"IF(L$4=0,\"\",IF(Liste!L31=\"\",\"\",ROUND(L$4/Liste!L$5*Liste!L31,L$6)))","v":""},{"$f":"IF(M$4=0,\"\",IF(Liste!M31=\"\",\"\",ROUND(M$4/Liste!M$5*Liste!M31,M$6)))","v":""},{"$f":"IF(N$4=0,\"\",IF(Liste!N31=\"\",\"\",ROUND(N$4/Liste!N$5*Liste!N31,N$6)))","v":""},{"$f":"IF(O$4=0,\"\",IF(Liste!O31=\"\",\"\",ROUND(O$4/Liste!O$5*Liste!O31,O$6)))","v":""},{"$f":"IF(P$4=0,\"\",IF(Liste!P31=\"\",\"\",ROUND(P$4/Liste!P$5*Liste!P31,P$6)))","v":""},{"$f":"IF(Q$4=0,\"\",IF(Liste!Q31=\"\",\"\",ROUND(Q$4/Liste!Q$5*Liste!Q31,Q$6)))","v":""},{"$f":"IF(R$4=0,\"\",IF(Liste!R31=\"\",\"\",ROUND(R$4/Liste!R$5*Liste!R31,R$6)))","v":""},{"$f":"IF(S$4=0,\"\",IF(Liste!S31=\"\",\"\",ROUND(S$4/Liste!S$5*Liste!S31,S$6)))","v":""},{"$f":"IF(T$4=0,\"\",IF(Liste!T31=\"\",\"\",ROUND(T$4/Liste!T$5*Liste!T31,T$6)))","v":""},{"$f":"IF(U$4=0,\"\",IF(Liste!U31=\"\",\"\",ROUND(U$4/Liste!U$5*Liste!U31,U$6)))","v":""},{"$f":"IF(V$4=0,\"\",IF(Liste!V31=\"\",\"\",ROUND(V$4/Liste!V$5*Liste!V31,V$6)))","v":""},{"$f":"IF(W$4=0,\"\",IF(Liste!W31=\"\",\"\",ROUND(W$4/Liste!W$5*Liste!W31,W$6)))","v":""},{"$f":"IF(X$4=0,\"\",IF(Liste!X31=\"\",\"\",ROUND(X$4/Liste!X$5*Liste!X31,X$6)))","v":""},{"$f":"IF(Y$4=0,\"\",IF(Liste!Y31=\"\",\"\",ROUND(Y$4/Liste!Y$5*Liste!Y31,Y$6)))","v":""},{"$f":"IF(Z$4=0,\"\",IF(Liste!Z31=\"\",\"\",ROUND(Z$4/Liste!Z$5*Liste!Z31,Z$6)))","v":""},{"$f":"IF(AA$4=0,\"\",IF(Liste!AA31=\"\",\"\",ROUND(AA$4/Liste!AA$5*Liste!AA31,AA$6)))","v":""},{"$f":"IF(AB$4=0,\"\",IF(Liste!AB31=\"\",\"\",ROUND(AB$4/Liste!AB$5*Liste!AB31,AB$6)))","v":""},{"$f":"IF(AC$4=0,\"\",IF(Liste!AC31=\"\",\"\",ROUND(AC$4/Liste!AC$5*Liste!AC31,AC$6)))","v":""},{"$f":"IF(AD$4=0,\"\",IF(Liste!AD31=\"\",\"\",ROUND(AD$4/Liste!AD$5*Liste!AD31,AD$6)))","v":""},{"$f":"IF(AE$4=0,\"\",IF(Liste!AE31=\"\",\"\",ROUND(AE$4/Liste!AE$5*Liste!AE31,AE$6)))","v":""},{"$f":"IF(AF$4=0,\"\",IF(Liste!AF31=\"\",\"\",ROUND(AF$4/Liste!AF$5*Liste!AF31,AF$6)))","v":""},{"$f":"IF(AG$4=0,\"\",IF(Liste!AG31=\"\",\"\",ROUND(AG$4/Liste!AG$5*Liste!AG31,AG$6)))","v":""},{"$f":"IF(AH$4=0,\"\",IF(Liste!AH31=\"\",\"\",ROUND(AH$4/Liste!AH$5*Liste!AH31,AH$6)))","v":""}]
["",{"$f":"IF(Liste!B32=\"\",\"\",Liste!B32)","v":"Dopppelrahmfrischkäse"},{"$f":"IF(Liste!C32=\"\",\"\",Liste!C32)","v":""},{"$f":"IF(Liste!D32=\"\",\"\",Liste!D32)","v":"[g]"},{"$f":"IF(E$4=0,\"\",IF(Liste!E32=\"\",\"\",ROUND(E$4/Liste!E$5*Liste!E32,E$6)))","v":""},{"$f":"IF(F$4=0,\"\",IF(Liste!F32=\"\",\"\",ROUND(F$4/Liste!F$5*Liste!F32,F$6)))","v":""},{"$f":"IF(G$4=0,\"\",IF(Liste!G32=\"\",\"\",ROUND(G$4/Liste!G$5*Liste!G32,G$6)))","v":""},{"$f":"IF(H$4=0,\"\",IF(Liste!H32=\"\",\"\",ROUND(H$4/Liste!H$5*Liste!H32,H$6)))","v":""},{"$f":"IF(I$4=0,\"\",IF(Liste!I32=\"\",\"\",ROUND(I$4/Liste!I$5*Liste!I32,I$6)))","v":""},{"$f":"IF(J$4=0,\"\",IF(Liste!J32=\"\",\"\",ROUND(J$4/Liste!J$5*Liste!J32,J$6)))","v":""},{"$f":"IF(K$4=0,\"\",IF(Liste!K32=\"\",\"\",ROUND(K$4/Liste!K$5*Liste!K32,K$6)))","v":""},{"$f":"IF(L$4=0,\"\",IF(Liste!L32=\"\",\"\",ROUND(L$4/Liste!L$5*Liste!L32,L$6)))","v":""},{"$f":"IF(M$4=0,\"\",IF(Liste!M32=\"\",\"\",ROUND(M$4/Liste!M$5*Liste!M32,M$6)))","v":""},{"$f":"IF(N$4=0,\"\",IF(Liste!N32=\"\",\"\",ROUND(N$4/Liste!N$5*Liste!N32,N$6)))","v":""},{"$f":"IF(O$4=0,\"\",IF(Liste!O32=\"\",\"\",ROUND(O$4/Liste!O$5*Liste!O32,O$6)))","v":""},{"$f":"IF(P$4=0,\"\",IF(Liste!P32=\"\",\"\",ROUND(P$4/Liste!P$5*Liste!P32,P$6)))","v":""},{"$f":"IF(Q$4=0,\"\",IF(Liste!Q32=\"\",\"\",ROUND(Q$4/Liste!Q$5*Liste!Q32,Q$6)))","v":""},{"$f":"IF(R$4=0,\"\",IF(Liste!R32=\"\",\"\",ROUND(R$4/Liste!R$5*Liste!R32,R$6)))","v":""},{"$f":"IF(S$4=0,\"\",IF(Liste!S32=\"\",\"\",ROUND(S$4/Liste!S$5*Liste!S32,S$6)))","v":""},{"$f":"IF(T$4=0,\"\",IF(Liste!T32=\"\",\"\",ROUND(T$4/Liste!T$5*Liste!T32,T$6)))","v":""},{"$f":"IF(U$4=0,\"\",IF(Liste!U32=\"\",\"\",ROUND(U$4/Liste!U$5*Liste!U32,U$6)))","v":""},{"$f":"IF(V$4=0,\"\",IF(Liste!V32=\"\",\"\",ROUND(V$4/Liste!V$5*Liste!V32,V$6)))","v":""},{"$f":"IF(W$4=0,\"\",IF(Liste!W32=\"\",\"\",ROUND(W$4/Liste!W$5*Liste!W32,W$6)))","v":""},{"$f":"IF(X$4=0,\"\",IF(Liste!X32=\"\",\"\",ROUND(X$4/Liste!X$5*Liste!X32,X$6)))","v":""},{"$f":"IF(Y$4=0,\"\",IF(Liste!Y32=\"\",\"\",ROUND(Y$4/Liste!Y$5*Liste!Y32,Y$6)))","v":""},{"$f":"IF(Z$4=0,\"\",IF(Liste!Z32=\"\",\"\",ROUND(Z$4/Liste!Z$5*Liste!Z32,Z$6)))","v":""},{"$f":"IF(AA$4=0,\"\",IF(Liste!AA32=\"\",\"\",ROUND(AA$4/Liste!AA$5*Liste!AA32,AA$6)))","v":""},{"$f":"IF(AB$4=0,\"\",IF(Liste!AB32=\"\",\"\",ROUND(AB$4/Liste!AB$5*Liste!AB32,AB$6)))","v":""},{"$f":"IF(AC$4=0,\"\",IF(Liste!AC32=\"\",\"\",ROUND(AC$4/Liste!AC$5*Liste!AC32,AC$6)))","v":""},{"$f":"IF(AD$4=0,\"\",IF(Liste!AD32=\"\",\"\",ROUND(AD$4/Liste!AD$5*Liste!AD32,AD$6)))","v":""},{"$f":"IF(AE$4=0,\"\",IF(Liste!AE32=\"\",\"\",ROUND(AE$4/Liste!AE$5*Liste!AE32,AE$6)))","v":""},{"$f":"IF(AF$4=0,\"\",IF(Liste!AF32=\"\",\"\",ROUND(AF$4/Liste!AF$5*Liste!AF32,AF$6)))","v":""},{"$f":"IF(AG$4=0,\"\",IF(Liste!AG32=\"\",\"\",ROUND(AG$4/Liste!AG$5*Liste!AG32,AG$6)))","v":""},{"$f":"IF(AH$4=0,\"\",IF(Liste!AH32=\"\",\"\",ROUND(AH$4/Liste!AH$5*Liste!AH32,AH$6)))","v":""}]
["",{"$f":"IF(Liste!B33=\"\",\"\",Liste!B33)","v":""},{"$f":"IF(Liste!C33=\"\",\"\",Liste!C33)","v":""},{"$f":"IF(Liste!D33=\"\",\"\",Liste!D33)","v":""},{"$f":"IF(E$4=0,\"\",IF(Liste!E33=\"\",\"\",ROUND(E$4/Liste!E$5*Liste!E33,E$6)))","v":""},{"$f":"IF(F$4=0,\"\",IF(Liste!F33=\"\",\"\",ROUND(F$4/Liste!F$5*Liste!F33,F$6)))","v":""},{"$f":"IF(G$4=0,\"\",IF(Liste!G33=\"\",\"\",ROUND(G$4/Liste!G$5*Liste!G33,G$6)))","v":""},{"$f":"IF(H$4=0,\"\",IF(Liste!H33=\"\",\"\",ROUND(H$4/Liste!H$5*Liste!H33,H$6)))","v":""},{"$f":"IF(I$4=0,\"\",IF(Liste!I33=\"\",\"\",ROUND(I$4/Liste!I$5*Liste!I33,I$6)))","v":""},{"$f":"IF(J$4=0,\"\",IF(Liste!J33=\"\",\"\",ROUND(J$4/Liste!J$5*Liste!J33,J$6)))","v":""},{"$f":"IF(K$4=0,\"\",IF(Liste!K33=\"\",\"\",ROUND(K$4/Liste!K$5*Liste!K33,K$6)))","v":""},{"$f":"IF(L$4=0,\"\",IF(Liste!L33=\"\",\"\",ROUND(L$4/Liste!L$5*Liste!L33,L$6)))","v":""},{"$f":"IF(M$4=0,\"\",IF(Liste!M33=\"\",\"\",ROUND(M$4/Liste!M$5*Liste!M33,M$6)))","v":""},{"$f":"IF(N$4=0,\"\",IF(Liste!N33=\"\",\"\",ROUND(N$4/Liste!N$5*Liste!N33,N$6)))","v":""},{"$f":"IF(O$4=0,\"\",IF(Liste!O33=\"\",\"\",ROUND(O$4/Liste!O$5*Liste!O33,O$6)))","v":""},{"$f":"IF(P$4=0,\"\",IF(Liste!P33=\"\",\"\",ROUND(P$4/Liste!P$5*Liste!P33,P$6)))","v":""},{"$f":"IF(Q$4=0,\"\",IF(Liste!Q33=\"\",\"\",ROUND(Q$4/Liste!Q$5*Liste!Q33,Q$6)))","v":""},{"$f":"IF(R$4=0,\"\",IF(Liste!R33=\"\",\"\",ROUND(R$4/Liste!R$5*Liste!R33,R$6)))","v":""},{"$f":"IF(S$4=0,\"\",IF(Liste!S33=\"\",\"\",ROUND(S$4/Liste!S$5*Liste!S33,S$6)))","v":""},{"$f":"IF(T$4=0,\"\",IF(Liste!T33=\"\",\"\",ROUND(T$4/Liste!T$5*Liste!T33,T$6)))","v":""},{"$f":"IF(U$4=0,\"\",IF(Liste!U33=\"\",\"\",ROUND(U$4/Liste!U$5*Liste!U33,U$6)))","v":""},{"$f":"IF(V$4=0,\"\",IF(Liste!V33=\"\",\"\",ROUND(V$4/Liste!V$5*Liste!V33,V$6)))","v":""},{"$f":"IF(W$4=0,\"\",IF(Liste!W33=\"\",\"\",ROUND(W$4/Liste!W$5*Liste!W33,W$6)))","v":""},{"$f":"IF(X$4=0,\"\",IF(Liste!X33=\"\",\"\",ROUND(X$4/Liste!X$5*Liste!X33,X$6)))","v":""},{"$f":"IF(Y$4=0,\"\",IF(Liste!Y33=\"\",\"\",ROUND(Y$4/Liste!Y$5*Liste!Y33,Y$6)))","v":""},{"$f":"IF(Z$4=0,\"\",IF(Liste!Z33=\"\",\"\",ROUND(Z$4/Liste!Z$5*Liste!Z33,Z$6)))","v":""},{"$f":"IF(AA$4=0,\"\",IF(Liste!AA33=\"\",\"\",ROUND(AA$4/Liste!AA$5*Liste!AA33,AA$6)))","v":""},{"$f":"IF(AB$4=0,\"\",IF(Liste!AB33=\"\",\"\",ROUND(AB$4/Liste!AB$5*Liste!AB33,AB$6)))","v":""},{"$f":"IF(AC$4=0,\"\",IF(Liste!AC33=\"\",\"\",ROUND(AC$4/Liste!AC$5*Liste!AC33,AC$6)))","v":""},{"$f":"IF(AD$4=0,\"\",IF(Liste!AD33=\"\",\"\",ROUND(AD$4/Liste!AD$5*Liste!AD33,AD$6)))","v":""},{"$f":"IF(AE$4=0,\"\",IF(Liste!AE33=\"\",\"\",ROUND(AE$4/Liste!AE$5*Liste!AE33,AE$6)))","v":""},{"$f":"IF(AF$4=0,\"\",IF(Liste!AF33=\"\",\"\",ROUND(AF$4/Liste!AF$5*Liste!AF33,AF$6)))","v":""},{"$f":"IF(AG$4=0,\"\",IF(Liste!AG33=\"\",\"\",ROUND(AG$4/Liste!AG$5*Liste!AG33,AG$6)))","v":""},{"$f":"IF(AH$4=0,\"\",IF(Liste!AH33=\"\",\"\",ROUND(AH$4/Liste!AH$5*Liste!AH33,AH$6)))","v":""}]
[7,{"$f":"IF(Liste!B34=\"\",\"\",Liste!B34)","v":"Eigelb"},{"$f":"IF(Liste!C34=\"\",\"\",Liste!C34)","v":""},{"$f":"IF(Liste!D34=\"\",\"\",Liste!D34)","v":"[St.]"},{"$f":"IF(E$4=0,\"\",IF(Liste!E34=\"\",\"\",ROUND(E$4/Liste!E$5*Liste!E34,E$6)))","v":""},{"$f":"IF(F$4=0,\"\",IF(Liste!F34=\"\",\"\",ROUND(F$4/Liste!F$5*Liste!F34,F$6)))","v":""},{"$f":"IF(G$4=0,\"\",IF(Liste!G34=\"\",\"\",ROUND(G$4/Liste!G$5*Liste!G34,G$6)))","v":""},{"$f":"IF(H$4=0,\"\",IF(Liste!H34=\"\",\"\",ROUND(H$4/Liste!H$5*Liste!H34,H$6)))","v":""},{"$f":"IF(I$4=0,\"\",IF(Liste!I34=\"\",\"\",ROUND(I$4/Liste!I$5*Liste!I34,I$6)))","v":""},{"$f":"IF(J$4=0,\"\",IF(Liste!J34=\"\",\"\",ROUND(J$4/Liste!J$5*Liste!J34,J$6)))","v":""},{"$f":"IF(K$4=0,\"\",IF(Liste!K34=\"\",\"\",ROUND(K$4/Liste!K$5*Liste!K34,K$6)))","v":2},{"$f":"IF(L$4=0,\"\",IF(Liste!L34=\"\",\"\",ROUND(L$4/Liste!L$5*Liste!L34,L$6)))","v":2},{"$f":"IF(M$4=0,\"\",IF(Liste!M34=\"\",\"\",ROUND(M$4/Liste!M$5*Liste!M34,M$6)))","v":""},{"$f":"IF(N$4=0,\"\",IF(Liste!N34=\"\",\"\",ROUND(N$4/Liste!N$5*Liste!N34,N$6)))","v":""},{"$f":"IF(O$4=0,\"\",IF(Liste!O34=\"\",\"\",ROUND(O$4/Liste!O$5*Liste!O34,O$6)))","v":2},{"$f":"IF(P$4=0,\"\",IF(Liste!P34=\"\",\"\",ROUND(P$4/Liste!P$5*Liste!P34,P$6)))","v":""},{"$f":"IF(Q$4=0,\"\",IF(Liste!Q34=\"\",\"\",ROUND(Q$4/Liste!Q$5*Liste!Q34,Q$6)))","v":""},{"$f":"IF(R$4=0,\"\",IF(Liste!R34=\"\",\"\",ROUND(R$4/Liste!R$5*Liste!R34,R$6)))","v":""},{"$f":"IF(S$4=0,\"\",IF(Liste!S34=\"\",\"\",ROUND(S$4/Liste!S$5*Liste!S34,S$6)))","v":""},{"$f":"IF(T$4=0,\"\",IF(Liste!T34=\"\",\"\",ROUND(T$4/Liste!T$5*Liste!T34,T$6)))","v":""},{"$f":"IF(U$4=0,\"\",IF(Liste!U34=\"\",\"\",ROUND(U$4/Liste!U$5*Liste!U34,U$6)))","v":""},{"$f":"IF(V$4=0,\"\",IF(Liste!V34=\"\",\"\",ROUND(V$4/Liste!V$5*Liste!V34,V$6)))","v":""},{"$f":"IF(W$4=0,\"\",IF(Liste!W34=\"\",\"\",ROUND(W$4/Liste!W$5*Liste!W34,W$6)))","v":""},{"$f":"IF(X$4=0,\"\",IF(Liste!X34=\"\",\"\",ROUND(X$4/Liste!X$5*Liste!X34,X$6)))","v":1},{"$f":"IF(Y$4=0,\"\",IF(Liste!Y34=\"\",\"\",ROUND(Y$4/Liste!Y$5*Liste!Y34,Y$6)))","v":""},{"$f":"IF(Z$4=0,\"\",IF(Liste!Z34=\"\",\"\",ROUND(Z$4/Liste!Z$5*Liste!Z34,Z$6)))","v":""},{"$f":"IF(AA$4=0,\"\",IF(Liste!AA34=\"\",\"\",ROUND(AA$4/Liste!AA$5*Liste!AA34,AA$6)))","v":""},{"$f":"IF(AB$4=0,\"\",IF(Liste!AB34=\"\",\"\",ROUND(AB$4/Liste!AB$5*Liste!AB34,AB$6)))","v":""},{"$f":"IF(AC$4=0,\"\",IF(Liste!AC34=\"\",\"\",ROUND(AC$4/Liste!AC$5*Liste!AC34,AC$6)))","v":""},{"$f":"IF(AD$4=0,\"\",IF(Liste!AD34=\"\",\"\",ROUND(AD$4/Liste!AD$5*Liste!AD34,AD$6)))","v":""},{"$f":"IF(AE$4=0,\"\",IF(Liste!AE34=\"\",\"\",ROUND(AE$4/Liste!AE$5*Liste!AE34,AE$6)))","v":""},{"$f":"IF(AF$4=0,\"\",IF(Liste!AF34=\"\",\"\",ROUND(AF$4/Liste!AF$5*Liste!AF34,AF$6)))","v":""},{"$f":"IF(AG$4=0,\"\",IF(Liste!AG34=\"\",\"\",ROUND(AG$4/Liste!AG$5*Liste!AG34,AG$6)))","v":""},{"$f":"IF(AH$4=0,\"\",IF(Liste!AH34=\"\",\"\",ROUND(AH$4/Liste!AH$5*Liste!AH34,AH$6)))","v":""}]
[14,{"$f":"IF(Liste!B35=\"\",\"\",Liste!B35)","v":"Eiweiß"},{"$f":"IF(Liste!C35=\"\",\"\",Liste!C35)","v":""},{"$f":"IF(Liste!D35=\"\",\"\",Liste!D35)","v":"[St.]"},{"$f":"IF(E$4=0,\"\",IF(Liste!E35=\"\",\"\",ROUND(E$4/Liste!E$5*Liste!E35,E$6)))","v":""},{"$f":"IF(F$4=0,\"\",IF(Liste!F35=\"\",\"\",ROUND(F$4/Liste!F$5*Liste!F35,F$6)))","v":2},{"$f":"IF(G$4=0,\"\",IF(Liste!G35=\"\",\"\",ROUND(G$4/Liste!G$5*Liste!G35,G$6)))","v":""},{"$f":"IF(H$4=0,\"\",IF(Liste!H35=\"\",\"\",ROUND(H$4/Liste!H$5*Liste!H35,H$6)))","v":""},{"$f":"IF(I$4=0,\"\",IF(Liste!I35=\"\",\"\",ROUND(I$4/Liste!I$5*Liste!I35,I$6)))","v":""},{"$f":"IF(J$4=0,\"\",IF(Liste!J35=\"\",\"\",ROUND(J$4/Liste!J$5*Liste!J35,J$6)))","v":""},{"$f":"IF(K$4=0,\"\",IF(Liste!K35=\"\",\"\",ROUND(K$4/Liste!K$5*Liste!K35,K$6)))","v":2},{"$f":"IF(L$4=0,\"\",IF(Liste!L35=\"\",\"\",ROUND(L$4/Liste!L$5*Liste!L35,L$6)))","v":2},{"$f":"IF(M$4=0,\"\",IF(Liste!M35=\"\",\"\",ROUND(M$4/Liste!M$5*Liste!M35,M$6)))","v":""},{"$f":"IF(N$4=0,\"\",IF(Liste!N35=\"\",\"\",ROUND(N$4/Liste!N$5*Liste!N35,N$6)))","v":""},{"$f":"IF(O$4=0,\"\",IF(Liste!O35=\"\",\"\",ROUND(O$4/Liste!O$5*Liste!O35,O$6)))","v":2},{"$f":"IF(P$4=0,\"\",IF(Liste!P35=\"\",\"\",ROUND(P$4/Liste!P$5*Liste!P35,P$6)))","v":4},{"$f":"IF(Q$4=0,\"\",IF(Liste!Q35=\"\",\"\",ROUND(Q$4/Liste!Q$5*Liste!Q35,Q$6)))","v":""},{"$f":"IF(R$4=0,\"\",IF(Liste!R35=\"\",\"\",ROUND(R$4/Liste!R$5*Liste!R35,R$6)))","v":""},{"$f":"IF(S$4=0,\"\",IF(Liste!S35=\"\",\"\",ROUND(S$4/Liste!S$5*Liste!S35,S$6)))","v":""},{"$f":"IF(T$4=0,\"\",IF(Liste!T35=\"\",\"\",ROUND(T$4/Liste!T$5*Liste!T35,T$6)))","v":""},{"$f":"IF(U$4=0,\"\",IF(Liste!U35=\"\",\"\",ROUND(U$4/Liste!U$5*Liste!U35,U$6)))","v":""},{"$f":"IF(V$4=0,\"\",IF(Liste!V35=\"\",\"\",ROUND(V$4/Liste!V$5*Liste!V35,V$6)))","v":2},{"$f":"IF(W$4=0,\"\",IF(Liste!W35=\"\",\"\",ROUND(W$4/Liste!W$5*Liste!W35,W$6)))","v":""},{"$f":"IF(X$4=0,\"\",IF(Liste!X35=\"\",\"\",ROUND(X$4/Liste!X$5*Liste!X35,X$6)))","v":""},{"$f":"IF(Y$4=0,\"\",IF(Liste!Y35=\"\",\"\",ROUND(Y$4/Liste!Y$5*Liste!Y35,Y$6)))","v":""},{"$f":"IF(Z$4=0,\"\",IF(Liste!Z35=\"\",\"\",ROUND(Z$4/Liste!Z$5*Liste!Z35,Z$6)))","v":""},{"$f":"IF(AA$4=0,\"\",IF(Liste!AA35=\"\",\"\",ROUND(AA$4/Liste!AA$5*Liste!AA35,AA$6)))","v":""},{"$f":"IF(AB$4=0,\"\",IF(Liste!AB35=\"\",\"\",ROUND(AB$4/Liste!AB$5*Liste!AB35,AB$6)))","v":""},{"$f":"IF(AC$4=0,\"\",IF(Liste!AC35=\"\",\"\",ROUND(AC$4/Liste!AC$5*Liste!AC35,AC$6)))","v":""},{"$f":"IF(AD$4=0,\"\",IF(Liste!AD35=\"\",\"\",ROUND(AD$4/Liste!AD$5*Liste!AD35,AD$6)))","v":""},{"$f":"IF(AE$4=0,\"\",IF(Liste!AE35=\"\",\"\",ROUND(AE$4/Liste!AE$5*Liste!AE35,AE$6)))","v":""},{"$f":"IF(AF$4=0,\"\",IF(Liste!AF35=\"\",\"\",ROUND(AF$4/Liste!AF$5*Liste!AF35,AF$6)))","v":""},{"$f":"IF(AG$4=0,\"\",IF(Liste!AG35=\"\",\"\",ROUND(AG$4/Liste!AG$5*Liste!AG35,AG$6)))","v":""},{"$f":"IF(AH$4=0,\"\",IF(Liste!AH35=\"\",\"\",ROUND(AH$4/Liste!AH$5*Liste!AH35,AH$6)))","v":""}]
[1,{"$f":"IF(Liste!B36=\"\",\"\",Liste!B36)","v":"Zitrone"},{"$f":"IF(Liste!C36=\"\",\"\",Liste!C36)","v":""},{"$f":"IF(Liste!D36=\"\",\"\",Liste!D36)","v":"[St.]"},{"$f":"IF(E$4=0,\"\",IF(Liste!E36=\"\",\"\",ROUND(E$4/Liste!E$5*Liste!E36,E$6)))","v":""},{"$f":"IF(F$4=0,\"\",IF(Liste!F36=\"\",\"\",ROUND(F$4/Liste!F$5*Liste!F36,F$6)))","v":""},{"$f":"IF(G$4=0,\"\",IF(Liste!G36=\"\",\"\",ROUND(G$4/Liste!G$5*Liste!G36,G$6)))","v":""},{"$f":"IF(H$4=0,\"\",IF(Liste!H36=\"\",\"\",ROUND(H$4/Liste!H$5*Liste!H36,H$6)))","v":""},{"$f":"IF(I$4=0,\"\",IF(Liste!I36=\"\",\"\",ROUND(I$4/Liste!I$5*Liste!I36,I$6)))","v":""},{"$f":"IF(J$4=0,\"\",IF(Liste!J36=\"\",\"\",ROUND(J$4/Liste!J$5*Liste!J36,J$6)))","v":""},{"$f":"IF(K$4=0,\"\",IF(Liste!K36=\"\",\"\",ROUND(K$4/Liste!K$5*Liste!K36,K$6)))","v":""},{"$f":"IF(L$4=0,\"\",IF(Liste!L36=\"\",\"\",ROUND(L$4/Liste!L$5*Liste!L36,L$6)))","v":""},{"$f":"IF(M$4=0,\"\",IF(Liste!M36=\"\",\"\",ROUND(M$4/Liste!M$5*Liste!M36,M$6)))","v":""},{"$f":"IF(N$4=0,\"\",IF(Liste!N36=\"\",\"\",ROUND(N$4/Liste!N$5*Liste!N36,N$6)))","v":""},{"$f":"IF(O$4=0,\"\",IF(Liste!O36=\"\",\"\",ROUND(O$4/Liste!O$5*Liste!O36,O$6)))","v":""},{"$f":"IF(P$4=0,\"\",IF(Liste!P36=\"\",\"\",ROUND(P$4/Liste!P$5*Liste!P36,P$6)))","v":""},{"$f":"IF(Q$4=0,\"\",IF(Liste!Q36=\"\",\"\",ROUND(Q$4/Liste!Q$5*Liste!Q36,Q$6)))","v":""},{"$f":"IF(R$4=0,\"\",IF(Liste!R36=\"\",\"\",ROUND(R$4/Liste!R$5*Liste!R36,R$6)))","v":""},{"$f":"IF(S$4=0,\"\",IF(Liste!S36=\"\",\"\",ROUND(S$4/Liste!S$5*Liste!S36,S$6)))","v":""},{"$f":"IF(T$4=0,\"\",IF(Liste!T36=\"\",\"\",ROUND(T$4/Liste!T$5*Liste!T36,T$6)))","v":""},{"$f":"IF(U$4=0,\"\",IF(Liste!U36=\"\",\"\",ROUND(U$4/Liste!U$5*Liste!U36,U$6)))","v":""},{"$f":"IF(V$4=0,\"\",IF(Liste!V36=\"\",\"\",ROUND(V$4/Liste!V$5*Liste!V36,V$6)))","v":1},{"$f":"IF(W$4=0,\"\",IF(Liste!W36=\"\",\"\",ROUND(W$4/Liste!W$5*Liste!W36,W$6)))","v":""},{"$f":"IF(X$4=0,\"\",IF(Liste!X36=\"\",\"\",ROUND(X$4/Liste!X$5*Liste!X36,X$6)))","v":""},{"$f":"IF(Y$4=0,\"\",IF(Liste!Y36=\"\",\"\",ROUND(Y$4/Liste!Y$5*Liste!Y36,Y$6)))","v":""},{"$f":"IF(Z$4=0,\"\",IF(Liste!Z36=\"\",\"\",ROUND(Z$4/Liste!Z$5*Liste!Z36,Z$6)))","v":""},{"$f":"IF(AA$4=0,\"\",IF(Liste!AA36=\"\",\"\",ROUND(AA$4/Liste!AA$5*Liste!AA36,AA$6)))","v":""},{"$f":"IF(AB$4=0,\"\",IF(Liste!AB36=\"\",\"\",ROUND(AB$4/Liste!AB$5*Liste!AB36,AB$6)))","v":""},{"$f":"IF(AC$4=0,\"\",IF(Liste!AC36=\"\",\"\",ROUND(AC$4/Liste!AC$5*Liste!AC36,AC$6)))","v":""},{"$f":"IF(AD$4=0,\"\",IF(Liste!AD36=\"\",\"\",ROUND(AD$4/Liste!AD$5*Liste!AD36,AD$6)))","v":""},{"$f":"IF(AE$4=0,\"\",IF(Liste!AE36=\"\",\"\",ROUND(AE$4/Liste!AE$5*Liste!AE36,AE$6)))","v":""},{"$f":"IF(AF$4=0,\"\",IF(Liste!AF36=\"\",\"\",ROUND(AF$4/Liste!AF$5*Liste!AF36,AF$6)))","v":""},{"$f":"IF(AG$4=0,\"\",IF(Liste!AG36=\"\",\"\",ROUND(AG$4/Liste!AG$5*Liste!AG36,AG$6)))","v":""},{"$f":"IF(AH$4=0,\"\",IF(Liste!AH36=\"\",\"\",ROUND(AH$4/Liste!AH$5*Liste!AH36,AH$6)))","v":""}]
[1,{"$f":"IF(Liste!B37=\"\",\"\",Liste!B37)","v":"abgeriebene Schale Zitrone"},{"$f":"IF(Liste!C37=\"\",\"\",Liste!C37)","v":""},{"$f":"IF(Liste!D37=\"\",\"\",Liste!D37)","v":"[St.]"},{"$f":"IF(E$4=0,\"\",IF(Liste!E37=\"\",\"\",ROUND(E$4/Liste!E$5*Liste!E37,E$6)))","v":""},{"$f":"IF(F$4=0,\"\",IF(Liste!F37=\"\",\"\",ROUND(F$4/Liste!F$5*Liste!F37,F$6)))","v":""},{"$f":"IF(G$4=0,\"\",IF(Liste!G37=\"\",\"\",ROUND(G$4/Liste!G$5*Liste!G37,G$6)))","v":""},{"$f":"IF(H$4=0,\"\",IF(Liste!H37=\"\",\"\",ROUND(H$4/Liste!H$5*Liste!H37,H$6)))","v":""},{"$f":"IF(I$4=0,\"\",IF(Liste!I37=\"\",\"\",ROUND(I$4/Liste!I$5*Liste!I37,I$6)))","v":""},{"$f":"IF(J$4=0,\"\",IF(Liste!J37=\"\",\"\",ROUND(J$4/Liste!J$5*Liste!J37,J$6)))","v":""},{"$f":"IF(K$4=0,\"\",IF(Liste!K37=\"\",\"\",ROUND(K$4/Liste!K$5*Liste!K37,K$6)))","v":""},{"$f":"IF(L$4=0,\"\",IF(Liste!L37=\"\",\"\",ROUND(L$4/Liste!L$5*Liste!L37,L$6)))","v":1},{"$f":"IF(M$4=0,\"\",IF(Liste!M37=\"\",\"\",ROUND(M$4/Liste!M$5*Liste!M37,M$6)))","v":""},{"$f":"IF(N$4=0,\"\",IF(Liste!N37=\"\",\"\",ROUND(N$4/Liste!N$5*Liste!N37,N$6)))","v":""},{"$f":"IF(O$4=0,\"\",IF(Liste!O37=\"\",\"\",ROUND(O$4/Liste!O$5*Liste!O37,O$6)))","v":""},{"$f":"IF(P$4=0,\"\",IF(Liste!P37=\"\",\"\",ROUND(P$4/Liste!P$5*Liste!P37,P$6)))","v":""},{"$f":"IF(Q$4=0,\"\",IF(Liste!Q37=\"\",\"\",ROUND(Q$4/Liste!Q$5*Liste!Q37,Q$6)))","v":""},{"$f":"IF(R$4=0,\"\",IF(Liste!R37=\"\",\"\",ROUND(R$4/Liste!R$5*Liste!R37,R$6)))","v":""},{"$f":"IF(S$4=0,\"\",IF(Liste!S37=\"\",\"\",ROUND(S$4/Liste!S$5*Liste!S37,S$6)))","v":""},{"$f":"IF(T$4=0,\"\",IF(Liste!T37=\"\",\"\",ROUND(T$4/Liste!T$5*Liste!T37,T$6)))","v":""},{"$f":"IF(U$4=0,\"\",IF(Liste!U37=\"\",\"\",ROUND(U$4/Liste!U$5*Liste!U37,U$6)))","v":""},{"$f":"IF(V$4=0,\"\",IF(Liste!V37=\"\",\"\",ROUND(V$4/Liste!V$5*Liste!V37,V$6)))","v":""},{"$f":"IF(W$4=0,\"\",IF(Liste!W37=\"\",\"\",ROUND(W$4/Liste!W$5*Liste!W37,W$6)))","v":""},{"$f":"IF(X$4=0,\"\",IF(Liste!X37=\"\",\"\",ROUND(X$4/Liste!X$5*Liste!X37,X$6)))","v":""},{"$f":"IF(Y$4=0,\"\",IF(Liste!Y37=\"\",\"\",ROUND(Y$4/Liste!Y$5*Liste!Y37,Y$6)))","v":""},{"$f":"IF(Z$4=0,\"\",IF(Liste!Z37=\"\",\"\",ROUND(Z$4/Liste!Z$5*Liste!Z37,Z$6)))","v":""},{"$f":"IF(AA$4=0,\"\",IF(Liste!AA37=\"\",\"\",ROUND(AA$4/Liste!AA$5*Liste!AA37,AA$6)))","v":""},{"$f":"IF(AB$4=0,\"\",IF(Liste!AB37=\"\",\"\",ROUND(AB$4/Liste!AB$5*Liste!AB37,AB$6)))","v":""},{"$f":"IF(AC$4=0,\"\",IF(Liste!AC37=\"\",\"\",ROUND(AC$4/Liste!AC$5*Liste!AC37,AC$6)))","v":""},{"$f":"IF(AD$4=0,\"\",IF(Liste!AD37=\"\",\"\",ROUND(AD$4/Liste!AD$5*Liste!AD37,AD$6)))","v":""},{"$f":"IF(AE$4=0,\"\",IF(Liste!AE37=\"\",\"\",ROUND(AE$4/Liste!AE$5*Liste!AE37,AE$6)))","v":""},{"$f":"IF(AF$4=0,\"\",IF(Liste!AF37=\"\",\"\",ROUND(AF$4/Liste!AF$5*Liste!AF37,AF$6)))","v":""},{"$f":"IF(AG$4=0,\"\",IF(Liste!AG37=\"\",\"\",ROUND(AG$4/Liste!AG$5*Liste!AG37,AG$6)))","v":""},{"$f":"IF(AH$4=0,\"\",IF(Liste!AH37=\"\",\"\",ROUND(AH$4/Liste!AH$5*Liste!AH37,AH$6)))","v":""}]
["",{"$f":"IF(Liste!B38=\"\",\"\",Liste!B38)","v":"abgeriebene Schale Orange"},{"$f":"IF(Liste!C38=\"\",\"\",Liste!C38)","v":""},{"$f":"IF(Liste!D38=\"\",\"\",Liste!D38)","v":"[St.]"},{"$f":"IF(E$4=0,\"\",IF(Liste!E38=\"\",\"\",ROUND(E$4/Liste!E$5*Liste!E38,E$6)))","v":""},{"$f":"IF(F$4=0,\"\",IF(Liste!F38=\"\",\"\",ROUND(F$4/Liste!F$5*Liste!F38,F$6)))","v":""},{"$f":"IF(G$4=0,\"\",IF(Liste!G38=\"\",\"\",ROUND(G$4/Liste!G$5*Liste!G38,G$6)))","v":""},{"$f":"IF(H$4=0,\"\",IF(Liste!H38=\"\",\"\",ROUND(H$4/Liste!H$5*Liste!H38,H$6)))","v":""},{"$f":"IF(I$4=0,\"\",IF(Liste!I38=\"\",\"\",ROUND(I$4/Liste!I$5*Liste!I38,I$6)))","v":""},{"$f":"IF(J$4=0,\"\",IF(Liste!J38=\"\",\"\",ROUND(J$4/Liste!J$5*Liste!J38,J$6)))","v":""},{"$f":"IF(K$4=0,\"\",IF(Liste!K38=\"\",\"\",ROUND(K$4/Liste!K$5*Liste!K38,K$6)))","v":""},{"$f":"IF(L$4=0,\"\",IF(Liste!L38=\"\",\"\",ROUND(L$4/Liste!L$5*Liste!L38,L$6)))","v":""},{"$f":"IF(M$4=0,\"\",IF(Liste!M38=\"\",\"\",ROUND(M$4/Liste!M$5*Liste!M38,M$6)))","v":""},{"$f":"IF(N$4=0,\"\",IF(Liste!N38=\"\",\"\",ROUND(N$4/Liste!N$5*Liste!N38,N$6)))","v":""},{"$f":"IF(O$4=0,\"\",IF(Liste!O38=\"\",\"\",ROUND(O$4/Liste!O$5*Liste!O38,O$6)))","v":""},{"$f":"IF(P$4=0,\"\",IF(Liste!P38=\"\",\"\",ROUND(P$4/Liste!P$5*Liste!P38,P$6)))","v":""},{"$f":"IF(Q$4=0,\"\",IF(Liste!Q38=\"\",\"\",ROUND(Q$4/Liste!Q$5*Liste!Q38,Q$6)))","v":""},{"$f":"IF(R$4=0,\"\",IF(Liste!R38=\"\",\"\",ROUND(R$4/Liste!R$5*Liste!R38,R$6)))","v":""},{"$f":"IF(S$4=0,\"\",IF(Liste!S38=\"\",\"\",ROUND(S$4/Liste!S$5*Liste!S38,S$6)))","v":""},{"$f":"IF(T$4=0,\"\",IF(Liste!T38=\"\",\"\",ROUND(T$4/Liste!T$5*Liste!T38,T$6)))","v":""},{"$f":"IF(U$4=0,\"\",IF(Liste!U38=\"\",\"\",ROUND(U$4/Liste!U$5*Liste!U38,U$6)))","v":""},{"$f":"IF(V$4=0,\"\",IF(Liste!V38=\"\",\"\",ROUND(V$4/Liste!V$5*Liste!V38,V$6)))","v":""},{"$f":"IF(W$4=0,\"\",IF(Liste!W38=\"\",\"\",ROUND(W$4/Liste!W$5*Liste!W38,W$6)))","v":""},{"$f":"IF(X$4=0,\"\",IF(Liste!X38=\"\",\"\",ROUND(X$4/Liste!X$5*Liste!X38,X$6)))","v":""},{"$f":"IF(Y$4=0,\"\",IF(Liste!Y38=\"\",\"\",ROUND(Y$4/Liste!Y$5*Liste!Y38,Y$6)))","v":""},{"$f":"IF(Z$4=0,\"\",IF(Liste!Z38=\"\",\"\",ROUND(Z$4/Liste!Z$5*Liste!Z38,Z$6)))","v":""},{"$f":"IF(AA$4=0,\"\",IF(Liste!AA38=\"\",\"\",ROUND(AA$4/Liste!AA$5*Liste!AA38,AA$6)))","v":""},{"$f":"IF(AB$4=0,\"\",IF(Liste!AB38=\"\",\"\",ROUND(AB$4/Liste!AB$5*Liste!AB38,AB$6)))","v":""},{"$f":"IF(AC$4=0,\"\",IF(Liste!AC38=\"\",\"\",ROUND(AC$4/Liste!AC$5*Liste!AC38,AC$6)))","v":""},{"$f":"IF(AD$4=0,\"\",IF(Liste!AD38=\"\",\"\",ROUND(AD$4/Liste!AD$5*Liste!AD38,AD$6)))","v":""},{"$f":"IF(AE$4=0,\"\",IF(Liste!AE38=\"\",\"\",ROUND(AE$4/Liste!AE$5*Liste!AE38,AE$6)))","v":""},{"$f":"IF(AF$4=0,\"\",IF(Liste!AF38=\"\",\"\",ROUND(AF$4/Liste!AF$5*Liste!AF38,AF$6)))","v":""},{"$f":"IF(AG$4=0,\"\",IF(Liste!AG38=\"\",\"\",ROUND(AG$4/Liste!AG$5*Liste!AG38,AG$6)))","v":""},{"$f":"IF(AH$4=0,\"\",IF(Liste!AH38=\"\",\"\",ROUND(AH$4/Liste!AH$5*Liste!AH38,AH$6)))","v":""}]
["",{"$f":"IF(Liste!B39=\"\",\"\",Liste!B39)","v":"Vanillieschoten"},{"$f":"IF(Liste!C39=\"\",\"\",Liste!C39)","v":""},{"$f":"IF(Liste!D39=\"\",\"\",Liste!D39)","v":"[St.]"},{"$f":"IF(E$4=0,\"\",IF(Liste!E39=\"\",\"\",ROUND(E$4/Liste!E$5*Liste!E39,E$6)))","v":""},{"$f":"IF(F$4=0,\"\",IF(Liste!F39=\"\",\"\",ROUND(F$4/Liste!F$5*Liste!F39,F$6)))","v":""},{"$f":"IF(G$4=0,\"\",IF(Liste!G39=\"\",\"\",ROUND(G$4/Liste!G$5*Liste!G39,G$6)))","v":""},{"$f":"IF(H$4=0,\"\",IF(Liste!H39=\"\",\"\",ROUND(H$4/Liste!H$5*Liste!H39,H$6)))","v":""},{"$f":"IF(I$4=0,\"\",IF(Liste!I39=\"\",\"\",ROUND(I$4/Liste!I$5*Liste!I39,I$6)))","v":""},{"$f":"IF(J$4=0,\"\",IF(Liste!J39=\"\",\"\",ROUND(J$4/Liste!J$5*Liste!J39,J$6)))","v":""},{"$f":"IF(K$4=0,\"\",IF(Liste!K39=\"\",\"\",ROUND(K$4/Liste!K$5*Liste!K39,K$6)))","v":""},{"$f":"IF(L$4=0,\"\",IF(Liste!L39=\"\",\"\",ROUND(L$4/Liste!L$5*Liste!L39,L$6)))","v":""},{"$f":"IF(M$4=0,\"\",IF(Liste!M39=\"\",\"\",ROUND(M$4/Liste!M$5*Liste!M39,M$6)))","v":""},{"$f":"IF(N$4=0,\"\",IF(Liste!N39=\"\",\"\",ROUND(N$4/Liste!N$5*Liste!N39,N$6)))","v":""},{"$f":"IF(O$4=0,\"\",IF(Liste!O39=\"\",\"\",ROUND(O$4/Liste!O$5*Liste!O39,O$6)))","v":""},{"$f":"IF(P$4=0,\"\",IF(Liste!P39=\"\",\"\",ROUND(P$4/Liste!P$5*Liste!P39,P$6)))","v":""},{"$f":"IF(Q$4=0,\"\",IF(Liste!Q39=\"\",\"\",ROUND(Q$4/Liste!Q$5*Liste!Q39,Q$6)))","v":""},{"$f":"IF(R$4=0,\"\",IF(Liste!R39=\"\",\"\",ROUND(R$4/Liste!R$5*Liste!R39,R$6)))","v":""},{"$f":"IF(S$4=0,\"\",IF(Liste!S39=\"\",\"\",ROUND(S$4/Liste!S$5*Liste!S39,S$6)))","v":""},{"$f":"IF(T$4=0,\"\",IF(Liste!T39=\"\",\"\",ROUND(T$4/Liste!T$5*Liste!T39,T$6)))","v":""},{"$f":"IF(U$4=0,\"\",IF(Liste!U39=\"\",\"\",ROUND(U$4/Liste!U$5*Liste!U39,U$6)))","v":""},{"$f":"IF(V$4=0,\"\",IF(Liste!V39=\"\",\"\",ROUND(V$4/Liste!V$5*Liste!V39,V$6)))","v":""},{"$f":"IF(W$4=0,\"\",IF(Liste!W39=\"\",\"\",ROUND(W$4/Liste!W$5*Liste!W39,W$6)))","v":""},{"$f":"IF(X$4=0,\"\",IF(Liste!X39=\"\",\"\",ROUND(X$4/Liste!X$5*Liste!X39,X$6)))","v":""},{"$f":"IF(Y$4=0,\"\",IF(Liste!Y39=\"\",\"\",ROUND(Y$4/Liste!Y$5*Liste!Y39,Y$6)))","v":""},{"$f":"IF(Z$4=0,\"\",IF(Liste!Z39=\"\",\"\",ROUND(Z$4/Liste!Z$5*Liste!Z39,Z$6)))","v":""},{"$f":"IF(AA$4=0,\"\",IF(Liste!AA39=\"\",\"\",ROUND(AA$4/Liste!AA$5*Liste!AA39,AA$6)))","v":""},{"$f":"IF(AB$4=0,\"\",IF(Liste!AB39=\"\",\"\",ROUND(AB$4/Liste!AB$5*Liste!AB39,AB$6)))","v":""},{"$f":"IF(AC$4=0,\"\",IF(Liste!AC39=\"\",\"\",ROUND(AC$4/Liste!AC$5*Liste!AC39,AC$6)))","v":""},{"$f":"IF(AD$4=0,\"\",IF(Liste!AD39=\"\",\"\",ROUND(AD$4/Liste!AD$5*Liste!AD39,AD$6)))","v":""},{"$f":"IF(AE$4=0,\"\",IF(Liste!AE39=\"\",\"\",ROUND(AE$4/Liste!AE$5*Liste!AE39,AE$6)))","v":""},{"$f":"IF(AF$4=0,\"\",IF(Liste!AF39=\"\",\"\",ROUND(AF$4/Liste!AF$5*Liste!AF39,AF$6)))","v":""},{"$f":"IF(AG$4=0,\"\",IF(Liste!AG39=\"\",\"\",ROUND(AG$4/Liste!AG$5*Liste!AG39,AG$6)))","v":""},{"$f":"IF(AH$4=0,\"\",IF(Liste!AH39=\"\",\"\",ROUND(AH$4/Liste!AH$5*Liste!AH39,AH$6)))","v":""}]
["",{"$f":"IF(Liste!B40=\"\",\"\",Liste!B40)","v":"Backoblaten"},{"$f":"IF(Liste!C40=\"\",\"\",Liste!C40)","v":"d = 5 cm"},{"$f":"IF(Liste!D40=\"\",\"\",Liste!D40)","v":"[St.]"},{"$f":"IF(E$4=0,\"\",IF(Liste!E40=\"\",\"\",ROUND(E$4/Liste!E$5*Liste!E40,E$6)))","v":""},{"$f":"IF(F$4=0,\"\",IF(Liste!F40=\"\",\"\",ROUND(F$4/Liste!F$5*Liste!F40,F$6)))","v":""},{"$f":"IF(G$4=0,\"\",IF(Liste!G40=\"\",\"\",ROUND(G$4/Liste!G$5*Liste!G40,G$6)))","v":""},{"$f":"IF(H$4=0,\"\",IF(Liste!H40=\"\",\"\",ROUND(H$4/Liste!H$5*Liste!H40,H$6)))","v":""},{"$f":"IF(I$4=0,\"\",IF(Liste!I40=\"\",\"\",ROUND(I$4/Liste!I$5*Liste!I40,I$6)))","v":""},{"$f":"IF(J$4=0,\"\",IF(Liste!J40=\"\",\"\",ROUND(J$4/Liste!J$5*Liste!J40,J$6)))","v":""},{"$f":"IF(K$4=0,\"\",IF(Liste!K40=\"\",\"\",ROUND(K$4/Liste!K$5*Liste!K40,K$6)))","v":""},{"$f":"IF(L$4=0,\"\",IF(Liste!L40=\"\",\"\",ROUND(L$4/Liste!L$5*Liste!L40,L$6)))","v":""},{"$f":"IF(M$4=0,\"\",IF(Liste!M40=\"\",\"\",ROUND(M$4/Liste!M$5*Liste!M40,M$6)))","v":""},{"$f":"IF(N$4=0,\"\",IF(Liste!N40=\"\",\"\",ROUND(N$4/Liste!N$5*Liste!N40,N$6)))","v":""},{"$f":"IF(O$4=0,\"\",IF(Liste!O40=\"\",\"\",ROUND(O$4/Liste!O$5*Liste!O40,O$6)))","v":""},{"$f":"IF(P$4=0,\"\",IF(Liste!P40=\"\",\"\",ROUND(P$4/Liste!P$5*Liste!P40,P$6)))","v":""},{"$f":"IF(Q$4=0,\"\",IF(Liste!Q40=\"\",\"\",ROUND(Q$4/Liste!Q$5*Liste!Q40,Q$6)))","v":""},{"$f":"IF(R$4=0,\"\",IF(Liste!R40=\"\",\"\",ROUND(R$4/Liste!R$5*Liste!R40,R$6)))","v":""},{"$f":"IF(S$4=0,\"\",IF(Liste!S40=\"\",\"\",ROUND(S$4/Liste!S$5*Liste!S40,S$6)))","v":""},{"$f":"IF(T$4=0,\"\",IF(Liste!T40=\"\",\"\",ROUND(T$4/Liste!T$5*Liste!T40,T$6)))","v":""},{"$f":"IF(U$4=0,\"\",IF(Liste!U40=\"\",\"\",ROUND(U$4/Liste!U$5*Liste!U40,U$6)))","v":""},{"$f":"IF(V$4=0,\"\",IF(Liste!V40=\"\",\"\",ROUND(V$4/Liste!V$5*Liste!V40,V$6)))","v":""},{"$f":"IF(W$4=0,\"\",IF(Liste!W40=\"\",\"\",ROUND(W$4/Liste!W$5*Liste!W40,W$6)))","v":""},{"$f":"IF(X$4=0,\"\",IF(Liste!X40=\"\",\"\",ROUND(X$4/Liste!X$5*Liste!X40,X$6)))","v":""},{"$f":"IF(Y$4=0,\"\",IF(Liste!Y40=\"\",\"\",ROUND(Y$4/Liste!Y$5*Liste!Y40,Y$6)))","v":""},{"$f":"IF(Z$4=0,\"\",IF(Liste!Z40=\"\",\"\",ROUND(Z$4/Liste!Z$5*Liste!Z40,Z$6)))","v":""},{"$f":"IF(AA$4=0,\"\",IF(Liste!AA40=\"\",\"\",ROUND(AA$4/Liste!AA$5*Liste!AA40,AA$6)))","v":""},{"$f":"IF(AB$4=0,\"\",IF(Liste!AB40=\"\",\"\",ROUND(AB$4/Liste!AB$5*Liste!AB40,AB$6)))","v":""},{"$f":"IF(AC$4=0,\"\",IF(Liste!AC40=\"\",\"\",ROUND(AC$4/Liste!AC$5*Liste!AC40,AC$6)))","v":""},{"$f":"IF(AD$4=0,\"\",IF(Liste!AD40=\"\",\"\",ROUND(AD$4/Liste!AD$5*Liste!AD40,AD$6)))","v":""},{"$f":"IF(AE$4=0,\"\",IF(Liste!AE40=\"\",\"\",ROUND(AE$4/Liste!AE$5*Liste!AE40,AE$6)))","v":""},{"$f":"IF(AF$4=0,\"\",IF(Liste!AF40=\"\",\"\",ROUND(AF$4/Liste!AF$5*Liste!AF40,AF$6)))","v":""},{"$f":"IF(AG$4=0,\"\",IF(Liste!AG40=\"\",\"\",ROUND(AG$4/Liste!AG$5*Liste!AG40,AG$6)))","v":""},{"$f":"IF(AH$4=0,\"\",IF(Liste!AH40=\"\",\"\",ROUND(AH$4/Liste!AH$5*Liste!AH40,AH$6)))","v":""}]
["",{"$f":"IF(Liste!B41=\"\",\"\",Liste!B41)","v":""},{"$f":"IF(Liste!C41=\"\",\"\",Liste!C41)","v":""},{"$f":"IF(Liste!D41=\"\",\"\",Liste!D41)","v":""},{"$f":"IF(E$4=0,\"\",IF(Liste!E41=\"\",\"\",ROUND(E$4/Liste!E$5*Liste!E41,E$6)))","v":""},{"$f":"IF(F$4=0,\"\",IF(Liste!F41=\"\",\"\",ROUND(F$4/Liste!F$5*Liste!F41,F$6)))","v":""},{"$f":"IF(G$4=0,\"\",IF(Liste!G41=\"\",\"\",ROUND(G$4/Liste!G$5*Liste!G41,G$6)))","v":""},{"$f":"IF(H$4=0,\"\",IF(Liste!H41=\"\",\"\",ROUND(H$4/Liste!H$5*Liste!H41,H$6)))","v":""},{"$f":"IF(I$4=0,\"\",IF(Liste!I41=\"\",\"\",ROUND(I$4/Liste!I$5*Liste!I41,I$6)))","v":""},{"$f":"IF(J$4=0,\"\",IF(Liste!J41=\"\",\"\",ROUND(J$4/Liste!J$5*Liste!J41,J$6)))","v":""},{"$f":"IF(K$4=0,\"\",IF(Liste!K41=\"\",\"\",ROUND(K$4/Liste!K$5*Liste!K41,K$6)))","v":""},{"$f":"IF(L$4=0,\"\",IF(Liste!L41=\"\",\"\",ROUND(L$4/Liste!L$5*Liste!L41,L$6)))","v":""},{"$f":"IF(M$4=0,\"\",IF(Liste!M41=\"\",\"\",ROUND(M$4/Liste!M$5*Liste!M41,M$6)))","v":""},{"$f":"IF(N$4=0,\"\",IF(Liste!N41=\"\",\"\",ROUND(N$4/Liste!N$5*Liste!N41,N$6)))","v":""},{"$f":"IF(O$4=0,\"\",IF(Liste!O41=\"\",\"\",ROUND(O$4/Liste!O$5*Liste!O41,O$6)))","v":""},{"$f":"IF(P$4=0,\"\",IF(Liste!P41=\"\",\"\",ROUND(P$4/Liste!P$5*Liste!P41,P$6)))","v":""},{"$f":"IF(Q$4=0,\"\",IF(Liste!Q41=\"\",\"\",ROUND(Q$4/Liste!Q$5*Liste!Q41,Q$6)))","v":""},{"$f":"IF(R$4=0,\"\",IF(Liste!R41=\"\",\"\",ROUND(R$4/Liste!R$5*Liste!R41,R$6)))","v":""},{"$f":"IF(S$4=0,\"\",IF(Liste!S41=\"\",\"\",ROUND(S$4/Liste!S$5*Liste!S41,S$6)))","v":""},{"$f":"IF(T$4=0,\"\",IF(Liste!T41=\"\",\"\",ROUND(T$4/Liste!T$5*Liste!T41,T$6)))","v":""},{"$f":"IF(U$4=0,\"\",IF(Liste!U41=\"\",\"\",ROUND(U$4/Liste!U$5*Liste!U41,U$6)))","v":""},{"$f":"IF(V$4=0,\"\",IF(Liste!V41=\"\",\"\",ROUND(V$4/Liste!V$5*Liste!V41,V$6)))","v":""},{"$f":"IF(W$4=0,\"\",IF(Liste!W41=\"\",\"\",ROUND(W$4/Liste!W$5*Liste!W41,W$6)))","v":""},{"$f":"IF(X$4=0,\"\",IF(Liste!X41=\"\",\"\",ROUND(X$4/Liste!X$5*Liste!X41,X$6)))","v":""},{"$f":"IF(Y$4=0,\"\",IF(Liste!Y41=\"\",\"\",ROUND(Y$4/Liste!Y$5*Liste!Y41,Y$6)))","v":""},{"$f":"IF(Z$4=0,\"\",IF(Liste!Z41=\"\",\"\",ROUND(Z$4/Liste!Z$5*Liste!Z41,Z$6)))","v":""},{"$f":"IF(AA$4=0,\"\",IF(Liste!AA41=\"\",\"\",ROUND(AA$4/Liste!AA$5*Liste!AA41,AA$6)))","v":""},{"$f":"IF(AB$4=0,\"\",IF(Liste!AB41=\"\",\"\",ROUND(AB$4/Liste!AB$5*Liste!AB41,AB$6)))","v":""},{"$f":"IF(AC$4=0,\"\",IF(Liste!AC41=\"\",\"\",ROUND(AC$4/Liste!AC$5*Liste!AC41,AC$6)))","v":""},{"$f":"IF(AD$4=0,\"\",IF(Liste!AD41=\"\",\"\",ROUND(AD$4/Liste!AD$5*Liste!AD41,AD$6)))","v":""},{"$f":"IF(AE$4=0,\"\",IF(Liste!AE41=\"\",\"\",ROUND(AE$4/Liste!AE$5*Liste!AE41,AE$6)))","v":""},{"$f":"IF(AF$4=0,\"\",IF(Liste!AF41=\"\",\"\",ROUND(AF$4/Liste!AF$5*Liste!AF41,AF$6)))","v":""},{"$f":"IF(AG$4=0,\"\",IF(Liste!AG41=\"\",\"\",ROUND(AG$4/Liste!AG$5*Liste!AG41,AG$6)))","v":""},{"$f":"IF(AH$4=0,\"\",IF(Liste!AH41=\"\",\"\",ROUND(AH$4/Liste!AH$5*Liste!AH41,AH$6)))","v":""}]
[1,{"$f":"IF(Liste!B42=\"\",\"\",Liste!B42)","v":"Vanilliezucker"},{"$f":"IF(Liste!C42=\"\",\"\",Liste!C42)","v":""},{"$f":"IF(Liste!D42=\"\",\"\",Liste!D42)","v":"[Pck.]"},{"$f":"IF(E$4=0,\"\",IF(Liste!E42=\"\",\"\",ROUND(E$4/Liste!E$5*Liste!E42,E$6)))","v":""},{"$f":"IF(F$4=0,\"\",IF(Liste!F42=\"\",\"\",ROUND(F$4/Liste!F$5*Liste!F42,F$6)))","v":""},{"$f":"IF(G$4=0,\"\",IF(Liste!G42=\"\",\"\",ROUND(G$4/Liste!G$5*Liste!G42,G$6)))","v":""},{"$f":"IF(H$4=0,\"\",IF(Liste!H42=\"\",\"\",ROUND(H$4/Liste!H$5*Liste!H42,H$6)))","v":""},{"$f":"IF(I$4=0,\"\",IF(Liste!I42=\"\",\"\",ROUND(I$4/Liste!I$5*Liste!I42,I$6)))","v":""},{"$f":"IF(J$4=0,\"\",IF(Liste!J42=\"\",\"\",ROUND(J$4/Liste!J$5*Liste!J42,J$6)))","v":""},{"$f":"IF(K$4=0,\"\",IF(Liste!K42=\"\",\"\",ROUND(K$4/Liste!K$5*Liste!K42,K$6)))","v":""},{"$f":"IF(L$4=0,\"\",IF(Liste!L42=\"\",\"\",ROUND(L$4/Liste!L$5*Liste!L42,L$6)))","v":1},{"$f":"IF(M$4=0,\"\",IF(Liste!M42=\"\",\"\",ROUND(M$4/Liste!M$5*Liste!M42,M$6)))","v":""},{"$f":"IF(N$4=0,\"\",IF(Liste!N42=\"\",\"\",ROUND(N$4/Liste!N$5*Liste!N42,N$6)))","v":""},{"$f":"IF(O$4=0,\"\",IF(Liste!O42=\"\",\"\",ROUND(O$4/Liste!O$5*Liste!O42,O$6)))","v":""},{"$f":"IF(P$4=0,\"\",IF(Liste!P42=\"\",\"\",ROUND(P$4/Liste!P$5*Liste!P42,P$6)))","v":""},{"$f":"IF(Q$4=0,\"\",IF(Liste!Q42=\"\",\"\",ROUND(Q$4/Liste!Q$5*Liste!Q42,Q$6)))","v":""},{"$f":"IF(R$4=0,\"\",IF(Liste!R42=\"\",\"\",ROUND(R$4/Liste!R$5*Liste!R42,R$6)))","v":""},{"$f":"IF(S$4=0,\"\",IF(Liste!S42=\"\",\"\",ROUND(S$4/Liste!S$5*Liste!S42,S$6)))","v":""},{"$f":"IF(T$4=0,\"\",IF(Liste!T42=\"\",\"\",ROUND(T$4/Liste!T$5*Liste!T42,T$6)))","v":""},{"$f":"IF(U$4=0,\"\",IF(Liste!U42=\"\",\"\",ROUND(U$4/Liste!U$5*Liste!U42,U$6)))","v":""},{"$f":"IF(V$4=0,\"\",IF(Liste!V42=\"\",\"\",ROUND(V$4/Liste!V$5*Liste!V42,V$6)))","v":""},{"$f":"IF(W$4=0,\"\",IF(Liste!W42=\"\",\"\",ROUND(W$4/Liste!W$5*Liste!W42,W$6)))","v":""},{"$f":"IF(X$4=0,\"\",IF(Liste!X42=\"\",\"\",ROUND(X$4/Liste!X$5*Liste!X42,X$6)))","v":""},{"$f":"IF(Y$4=0,\"\",IF(Liste!Y42=\"\",\"\",ROUND(Y$4/Liste!Y$5*Liste!Y42,Y$6)))","v":""},{"$f":"IF(Z$4=0,\"\",IF(Liste!Z42=\"\",\"\",ROUND(Z$4/Liste!Z$5*Liste!Z42,Z$6)))","v":""},{"$f":"IF(AA$4=0,\"\",IF(Liste!AA42=\"\",\"\",ROUND(AA$4/Liste!AA$5*Liste!AA42,AA$6)))","v":""},{"$f":"IF(AB$4=0,\"\",IF(Liste!AB42=\"\",\"\",ROUND(AB$4/Liste!AB$5*Liste!AB42,AB$6)))","v":""},{"$f":"IF(AC$4=0,\"\",IF(Liste!AC42=\"\",\"\",ROUND(AC$4/Liste!AC$5*Liste!AC42,AC$6)))","v":""},{"$f":"IF(AD$4=0,\"\",IF(Liste!AD42=\"\",\"\",ROUND(AD$4/Liste!AD$5*Liste!AD42,AD$6)))","v":""},{"$f":"IF(AE$4=0,\"\",IF(Liste!AE42=\"\",\"\",ROUND(AE$4/Liste!AE$5*Liste!AE42,AE$6)))","v":""},{"$f":"IF(AF$4=0,\"\",IF(Liste!AF42=\"\",\"\",ROUND(AF$4/Liste!AF$5*Liste!AF42,AF$6)))","v":""},{"$f":"IF(AG$4=0,\"\",IF(Liste!AG42=\"\",\"\",ROUND(AG$4/Liste!AG$5*Liste!AG42,AG$6)))","v":""},{"$f":"IF(AH$4=0,\"\",IF(Liste!AH42=\"\",\"\",ROUND(AH$4/Liste!AH$5*Liste!AH42,AH$6)))","v":""}]
["",{"$f":"IF(Liste!B43=\"\",\"\",Liste!B43)","v":""},{"$f":"IF(Liste!C43=\"\",\"\",Liste!C43)","v":""},{"$f":"IF(Liste!D43=\"\",\"\",Liste!D43)","v":""},{"$f":"IF(E$4=0,\"\",IF(Liste!E43=\"\",\"\",ROUND(E$4/Liste!E$5*Liste!E43,E$6)))","v":""},{"$f":"IF(F$4=0,\"\",IF(Liste!F43=\"\",\"\",ROUND(F$4/Liste!F$5*Liste!F43,F$6)))","v":""},{"$f":"IF(G$4=0,\"\",IF(Liste!G43=\"\",\"\",ROUND(G$4/Liste!G$5*Liste!G43,G$6)))","v":""},{"$f":"IF(H$4=0,\"\",IF(Liste!H43=\"\",\"\",ROUND(H$4/Liste!H$5*Liste!H43,H$6)))","v":""},{"$f":"IF(I$4=0,\"\",IF(Liste!I43=\"\",\"\",ROUND(I$4/Liste!I$5*Liste!I43,I$6)))","v":""},{"$f":"IF(J$4=0,\"\",IF(Liste!J43=\"\",\"\",ROUND(J$4/Liste!J$5*Liste!J43,J$6)))","v":""},{"$f":"IF(K$4=0,\"\",IF(Liste!K43=\"\",\"\",ROUND(K$4/Liste!K$5*Liste!K43,K$6)))","v":""},{"$f":"IF(L$4=0,\"\",IF(Liste!L43=\"\",\"\",ROUND(L$4/Liste!L$5*Liste!L43,L$6)))","v":""},{"$f":"IF(M$4=0,\"\",IF(Liste!M43=\"\",\"\",ROUND(M$4/Liste!M$5*Liste!M43,M$6)))","v":""},{"$f":"IF(N$4=0,\"\",IF(Liste!N43=\"\",\"\",ROUND(N$4/Liste!N$5*Liste!N43,N$6)))","v":""},{"$f":"IF(O$4=0,\"\",IF(Liste!O43=\"\",\"\",ROUND(O$4/Liste!O$5*Liste!O43,O$6)))","v":""},{"$f":"IF(P$4=0,\"\",IF(Liste!P43=\"\",\"\",ROUND(P$4/Liste!P$5*Liste!P43,P$6)))","v":""},{"$f":"IF(Q$4=0,\"\",IF(Liste!Q43=\"\",\"\",ROUND(Q$4/Liste!Q$5*Liste!Q43,Q$6)))","v":""},{"$f":"IF(R$4=0,\"\",IF(Liste!R43=\"\",\"\",ROUND(R$4/Liste!R$5*Liste!R43,R$6)))","v":""},{"$f":"IF(S$4=0,\"\",IF(Liste!S43=\"\",\"\",ROUND(S$4/Liste!S$5*Liste!S43,S$6)))","v":""},{"$f":"IF(T$4=0,\"\",IF(Liste!T43=\"\",\"\",ROUND(T$4/Liste!T$5*Liste!T43,T$6)))","v":""},{"$f":"IF(U$4=0,\"\",IF(Liste!U43=\"\",\"\",ROUND(U$4/Liste!U$5*Liste!U43,U$6)))","v":""},{"$f":"IF(V$4=0,\"\",IF(Liste!V43=\"\",\"\",ROUND(V$4/Liste!V$5*Liste!V43,V$6)))","v":""},{"$f":"IF(W$4=0,\"\",IF(Liste!W43=\"\",\"\",ROUND(W$4/Liste!W$5*Liste!W43,W$6)))","v":""},{"$f":"IF(X$4=0,\"\",IF(Liste!X43=\"\",\"\",ROUND(X$4/Liste!X$5*Liste!X43,X$6)))","v":""},{"$f":"IF(Y$4=0,\"\",IF(Liste!Y43=\"\",\"\",ROUND(Y$4/Liste!Y$5*Liste!Y43,Y$6)))","v":""},{"$f":"IF(Z$4=0,\"\",IF(Liste!Z43=\"\",\"\",ROUND(Z$4/Liste!Z$5*Liste!Z43,Z$6)))","v":""},{"$f":"IF(AA$4=0,\"\",IF(Liste!AA43=\"\",\"\",ROUND(AA$4/Liste!AA$5*Liste!AA43,AA$6)))","v":""},{"$f":"IF(AB$4=0,\"\",IF(Liste!AB43=\"\",\"\",ROUND(AB$4/Liste!AB$5*Liste!AB43,AB$6)))","v":""},{"$f":"IF(AC$4=0,\"\",IF(Liste!AC43=\"\",\"\",ROUND(AC$4/Liste!AC$5*Liste!AC43,AC$6)))","v":""},{"$f":"IF(AD$4=0,\"\",IF(Liste!AD43=\"\",\"\",ROUND(AD$4/Liste!AD$5*Liste!AD43,AD$6)))","v":""},{"$f":"IF(AE$4=0,\"\",IF(Liste!AE43=\"\",\"\",ROUND(AE$4/Liste!AE$5*Liste!AE43,AE$6)))","v":""},{"$f":"IF(AF$4=0,\"\",IF(Liste!AF43=\"\",\"\",ROUND(AF$4/Liste!AF$5*Liste!AF43,AF$6)))","v":""},{"$f":"IF(AG$4=0,\"\",IF(Liste!AG43=\"\",\"\",ROUND(AG$4/Liste!AG$5*Liste!AG43,AG$6)))","v":""},{"$f":"IF(AH$4=0,\"\",IF(Liste!AH43=\"\",\"\",ROUND(AH$4/Liste!AH$5*Liste!AH43,AH$6)))","v":""}]
["",{"$f":"IF(Liste!B44=\"\",\"\",Liste!B44)","v":"Puderzucker"},{"$f":"IF(Liste!C44=\"\",\"\",Liste!C44)","v":""},{"$f":"IF(Liste!D44=\"\",\"\",Liste!D44)","v":"[Tasse]"},{"$f":"IF(E$4=0,\"\",IF(Liste!E44=\"\",\"\",ROUND(E$4/Liste!E$5*Liste!E44,E$6)))","v":""},{"$f":"IF(F$4=0,\"\",IF(Liste!F44=\"\",\"\",ROUND(F$4/Liste!F$5*Liste!F44,F$6)))","v":""},{"$f":"IF(G$4=0,\"\",IF(Liste!G44=\"\",\"\",ROUND(G$4/Liste!G$5*Liste!G44,G$6)))","v":""},{"$f":"IF(H$4=0,\"\",IF(Liste!H44=\"\",\"\",ROUND(H$4/Liste!H$5*Liste!H44,H$6)))","v":""},{"$f":"IF(I$4=0,\"\",IF(Liste!I44=\"\",\"\",ROUND(I$4/Liste!I$5*Liste!I44,I$6)))","v":""},{"$f":"IF(J$4=0,\"\",IF(Liste!J44=\"\",\"\",ROUND(J$4/Liste!J$5*Liste!J44,J$6)))","v":""},{"$f":"IF(K$4=0,\"\",IF(Liste!K44=\"\",\"\",ROUND(K$4/Liste!K$5*Liste!K44,K$6)))","v":""},{"$f":"IF(L$4=0,\"\",IF(Liste!L44=\"\",\"\",ROUND(L$4/Liste!L$5*Liste!L44,L$6)))","v":""},{"$f":"IF(M$4=0,\"\",IF(Liste!M44=\"\",\"\",ROUND(M$4/Liste!M$5*Liste!M44,M$6)))","v":""},{"$f":"IF(N$4=0,\"\",IF(Liste!N44=\"\",\"\",ROUND(N$4/Liste!N$5*Liste!N44,N$6)))","v":""},{"$f":"IF(O$4=0,\"\",IF(Liste!O44=\"\",\"\",ROUND(O$4/Liste!O$5*Liste!O44,O$6)))","v":""},{"$f":"IF(P$4=0,\"\",IF(Liste!P44=\"\",\"\",ROUND(P$4/Liste!P$5*Liste!P44,P$6)))","v":""},{"$f":"IF(Q$4=0,\"\",IF(Liste!Q44=\"\",\"\",ROUND(Q$4/Liste!Q$5*Liste!Q44,Q$6)))","v":""},{"$f":"IF(R$4=0,\"\",IF(Liste!R44=\"\",\"\",ROUND(R$4/Liste!R$5*Liste!R44,R$6)))","v":""},{"$f":"IF(S$4=0,\"\",IF(Liste!S44=\"\",\"\",ROUND(S$4/Liste!S$5*Liste!S44,S$6)))","v":""},{"$f":"IF(T$4=0,\"\",IF(Liste!T44=\"\",\"\",ROUND(T$4/Liste!T$5*Liste!T44,T$6)))","v":""},{"$f":"IF(U$4=0,\"\",IF(Liste!U44=\"\",\"\",ROUND(U$4/Liste!U$5*Liste!U44,U$6)))","v":""},{"$f":"IF(V$4=0,\"\",IF(Liste!V44=\"\",\"\",ROUND(V$4/Liste!V$5*Liste!V44,V$6)))","v":""},{"$f":"IF(W$4=0,\"\",IF(Liste!W44=\"\",\"\",ROUND(W$4/Liste!W$5*Liste!W44,W$6)))","v":""},{"$f":"IF(X$4=0,\"\",IF(Liste!X44=\"\",\"\",ROUND(X$4/Liste!X$5*Liste!X44,X$6)))","v":""},{"$f":"IF(Y$4=0,\"\",IF(Liste!Y44=\"\",\"\",ROUND(Y$4/Liste!Y$5*Liste!Y44,Y$6)))","v":""},{"$f":"IF(Z$4=0,\"\",IF(Liste!Z44=\"\",\"\",ROUND(Z$4/Liste!Z$5*Liste!Z44,Z$6)))","v":""},{"$f":"IF(AA$4=0,\"\",IF(Liste!AA44=\"\",\"\",ROUND(AA$4/Liste!AA$5*Liste!AA44,AA$6)))","v":""},{"$f":"IF(AB$4=0,\"\",IF(Liste!AB44=\"\",\"\",ROUND(AB$4/Liste!AB$5*Liste!AB44,AB$6)))","v":""},{"$f":"IF(AC$4=0,\"\",IF(Liste!AC44=\"\",\"\",ROUND(AC$4/Liste!AC$5*Liste!AC44,AC$6)))","v":""},{"$f":"IF(AD$4=0,\"\",IF(Liste!AD44=\"\",\"\",ROUND(AD$4/Liste!AD$5*Liste!AD44,AD$6)))","v":""},{"$f":"IF(AE$4=0,\"\",IF(Liste!AE44=\"\",\"\",ROUND(AE$4/Liste!AE$5*Liste!AE44,AE$6)))","v":""},{"$f":"IF(AF$4=0,\"\",IF(Liste!AF44=\"\",\"\",ROUND(AF$4/Liste!AF$5*Liste!AF44,AF$6)))","v":""},{"$f":"IF(AG$4=0,\"\",IF(Liste!AG44=\"\",\"\",ROUND(AG$4/Liste!AG$5*Liste!AG44,AG$6)))","v":""},{"$f":"IF(AH$4=0,\"\",IF(Liste!AH44=\"\",\"\",ROUND(AH$4/Liste!AH$5*Liste!AH44,AH$6)))","v":""}]
[475,{"$f":"IF(Liste!B45=\"\",\"\",Liste!B45)","v":"Puderzucker"},{"$f":"IF(Liste!C45=\"\",\"\",Liste!C45)","v":""},{"$f":"IF(Liste!D45=\"\",\"\",Liste!D45)","v":"[g]"},{"$f":"IF(E$4=0,\"\",IF(Liste!E45=\"\",\"\",ROUND(E$4/Liste!E$5*Liste!E45,E$6)))","v":""},{"$f":"IF(F$4=0,\"\",IF(Liste!F45=\"\",\"\",ROUND(F$4/Liste!F$5*Liste!F45,F$6)))","v":150},{"$f":"IF(G$4=0,\"\",IF(Liste!G45=\"\",\"\",ROUND(G$4/Liste!G$5*Liste!G45,G$6)))","v":""},{"$f":"IF(H$4=0,\"\",IF(Liste!H45=\"\",\"\",ROUND(H$4/Liste!H$5*Liste!H45,H$6)))","v":""},{"$f":"IF(I$4=0,\"\",IF(Liste!I45=\"\",\"\",ROUND(I$4/Liste!I$5*Liste!I45,I$6)))","v":""},{"$f":"IF(J$4=0,\"\",IF(Liste!J45=\"\",\"\",ROUND(J$4/Liste!J$5*Liste!J45,J$6)))","v":""},{"$f":"IF(K$4=0,\"\",IF(Liste!K45=\"\",\"\",ROUND(K$4/Liste!K$5*Liste!K45,K$6)))","v":""},{"$f":"IF(L$4=0,\"\",IF(Liste!L45=\"\",\"\",ROUND(L$4/Liste!L$5*Liste!L45,L$6)))","v":""},{"$f":"IF(M$4=0,\"\",IF(Liste!M45=\"\",\"\",ROUND(M$4/Liste!M$5*Liste!M45,M$6)))","v":""},{"$f":"IF(N$4=0,\"\",IF(Liste!N45=\"\",\"\",ROUND(N$4/Liste!N$5*Liste!N45,N$6)))","v":""},{"$f":"IF(O$4=0,\"\",IF(Liste!O45=\"\",\"\",ROUND(O$4/Liste!O$5*Liste!O45,O$6)))","v":""},{"$f":"IF(P$4=0,\"\",IF(Liste!P45=\"\",\"\",ROUND(P$4/Liste!P$5*Liste!P45,P$6)))","v":200},{"$f":"IF(Q$4=0,\"\",IF(Liste!Q45=\"\",\"\",ROUND(Q$4/Liste!Q$5*Liste!Q45,Q$6)))","v":""},{"$f":"IF(R$4=0,\"\",IF(Liste!R45=\"\",\"\",ROUND(R$4/Liste!R$5*Liste!R45,R$6)))","v":""},{"$f":"IF(S$4=0,\"\",IF(Liste!S45=\"\",\"\",ROUND(S$4/Liste!S$5*Liste!S45,S$6)))","v":""},{"$f":"IF(T$4=0,\"\",IF(Liste!T45=\"\",\"\",ROUND(T$4/Liste!T$5*Liste!T45,T$6)))","v":""},{"$f":"IF(U$4=0,\"\",IF(Liste!U45=\"\",\"\",ROUND(U$4/Liste!U$5*Liste!U45,U$6)))","v":""},{"$f":"IF(V$4=0,\"\",IF(Liste!V45=\"\",\"\",ROUND(V$4/Liste!V$5*Liste!V45,V$6)))","v":""},{"$f":"IF(W$4=0,\"\",IF(Liste!W45=\"\",\"\",ROUND(W$4/Liste!W$5*Liste!W45,W$6)))","v":""},{"$f":"IF(X$4=0,\"\",IF(Liste!X45=\"\",\"\",ROUND(X$4/Liste!X$5*Liste!X45,X$6)))","v":125},{"$f":"IF(Y$4=0,\"\",IF(Liste!Y45=\"\",\"\",ROUND(Y$4/Liste!Y$5*Liste!Y45,Y$6)))","v":""},{"$f":"IF(Z$4=0,\"\",IF(Liste!Z45=\"\",\"\",ROUND(Z$4/Liste!Z$5*Liste!Z45,Z$6)))","v":""},{"$f":"IF(AA$4=0,\"\",IF(Liste!AA45=\"\",\"\",ROUND(AA$4/Liste!AA$5*Liste!AA45,AA$6)))","v":""},{"$f":"IF(AB$4=0,\"\",IF(Liste!AB45=\"\",\"\",ROUND(AB$4/Liste!AB$5*Liste!AB45,AB$6)))","v":""},{"$f":"IF(AC$4=0,\"\",IF(Liste!AC45=\"\",\"\",ROUND(AC$4/Liste!AC$5*Liste!AC45,AC$6)))","v":""},{"$f":"IF(AD$4=0,\"\",IF(Liste!AD45=\"\",\"\",ROUND(AD$4/Liste!AD$5*Liste!AD45,AD$6)))","v":""},{"$f":"IF(AE$4=0,\"\",IF(Liste!AE45=\"\",\"\",ROUND(AE$4/Liste!AE$5*Liste!AE45,AE$6)))","v":""},{"$f":"IF(AF$4=0,\"\",IF(Liste!AF45=\"\",\"\",ROUND(AF$4/Liste!AF$5*Liste!AF45,AF$6)))","v":""},{"$f":"IF(AG$4=0,\"\",IF(Liste!AG45=\"\",\"\",ROUND(AG$4/Liste!AG$5*Liste!AG45,AG$6)))","v":""},{"$f":"IF(AH$4=0,\"\",IF(Liste!AH45=\"\",\"\",ROUND(AH$4/Liste!AH$5*Liste!AH45,AH$6)))","v":""}]
["",{"$f":"IF(Liste!B46=\"\",\"\",Liste!B46)","v":""},{"$f":"IF(Liste!C46=\"\",\"\",Liste!C46)","v":""},{"$f":"IF(Liste!D46=\"\",\"\",Liste!D46)","v":""},{"$f":"IF(E$4=0,\"\",IF(Liste!E46=\"\",\"\",ROUND(E$4/Liste!E$5*Liste!E46,E$6)))","v":""},{"$f":"IF(F$4=0,\"\",IF(Liste!F46=\"\",\"\",ROUND(F$4/Liste!F$5*Liste!F46,F$6)))","v":""},{"$f":"IF(G$4=0,\"\",IF(Liste!G46=\"\",\"\",ROUND(G$4/Liste!G$5*Liste!G46,G$6)))","v":""},{"$f":"IF(H$4=0,\"\",IF(Liste!H46=\"\",\"\",ROUND(H$4/Liste!H$5*Liste!H46,H$6)))","v":""},{"$f":"IF(I$4=0,\"\",IF(Liste!I46=\"\",\"\",ROUND(I$4/Liste!I$5*Liste!I46,I$6)))","v":""},{"$f":"IF(J$4=0,\"\",IF(Liste!J46=\"\",\"\",ROUND(J$4/Liste!J$5*Liste!J46,J$6)))","v":""},{"$f":"IF(K$4=0,\"\",IF(Liste!K46=\"\",\"\",ROUND(K$4/Liste!K$5*Liste!K46,K$6)))","v":""},{"$f":"IF(L$4=0,\"\",IF(Liste!L46=\"\",\"\",ROUND(L$4/Liste!L$5*Liste!L46,L$6)))","v":""},{"$f":"IF(M$4=0,\"\",IF(Liste!M46=\"\",\"\",ROUND(M$4/Liste!M$5*Liste!M46,M$6)))","v":""},{"$f":"IF(N$4=0,\"\",IF(Liste!N46=\"\",\"\",ROUND(N$4/Liste!N$5*Liste!N46,N$6)))","v":""},{"$f":"IF(O$4=0,\"\",IF(Liste!O46=\"\",\"\",ROUND(O$4/Liste!O$5*Liste!O46,O$6)))","v":""},{"$f":"IF(P$4=0,\"\",IF(Liste!P46=\"\",\"\",ROUND(P$4/Liste!P$5*Liste!P46,P$6)))","v":""},{"$f":"IF(Q$4=0,\"\",IF(Liste!Q46=\"\",\"\",ROUND(Q$4/Liste!Q$5*Liste!Q46,Q$6)))","v":""},{"$f":"IF(R$4=0,\"\",IF(Liste!R46=\"\",\"\",ROUND(R$4/Liste!R$5*Liste!R46,R$6)))","v":""},{"$f":"IF(S$4=0,\"\",IF(Liste!S46=\"\",\"\",ROUND(S$4/Liste!S$5*Liste!S46,S$6)))","v":""},{"$f":"IF(T$4=0,\"\",IF(Liste!T46=\"\",\"\",ROUND(T$4/Liste!T$5*Liste!T46,T$6)))","v":""},{"$f":"IF(U$4=0,\"\",IF(Liste!U46=\"\",\"\",ROUND(U$4/Liste!U$5*Liste!U46,U$6)))","v":""},{"$f":"IF(V$4=0,\"\",IF(Liste!V46=\"\",\"\",ROUND(V$4/Liste!V$5*Liste!V46,V$6)))","v":""},{"$f":"IF(W$4=0,\"\",IF(Liste!W46=\"\",\"\",ROUND(W$4/Liste!W$5*Liste!W46,W$6)))","v":""},{"$f":"IF(X$4=0,\"\",IF(Liste!X46=\"\",\"\",ROUND(X$4/Liste!X$5*Liste!X46,X$6)))","v":""},{"$f":"IF(Y$4=0,\"\",IF(Liste!Y46=\"\",\"\",ROUND(Y$4/Liste!Y$5*Liste!Y46,Y$6)))","v":""},{"$f":"IF(Z$4=0,\"\",IF(Liste!Z46=\"\",\"\",ROUND(Z$4/Liste!Z$5*Liste!Z46,Z$6)))","v":""},{"$f":"IF(AA$4=0,\"\",IF(Liste!AA46=\"\",\"\",ROUND(AA$4/Liste!AA$5*Liste!AA46,AA$6)))","v":""},{"$f":"IF(AB$4=0,\"\",IF(Liste!AB46=\"\",\"\",ROUND(AB$4/Liste!AB$5*Liste!AB46,AB$6)))","v":""},{"$f":"IF(AC$4=0,\"\",IF(Liste!AC46=\"\",\"\",ROUND(AC$4/Liste!AC$5*Liste!AC46,AC$6)))","v":""},{"$f":"IF(AD$4=0,\"\",IF(Liste!AD46=\"\",\"\",ROUND(AD$4/Liste!AD$5*Liste!AD46,AD$6)))","v":""},{"$f":"IF(AE$4=0,\"\",IF(Liste!AE46=\"\",\"\",ROUND(AE$4/Liste!AE$5*Liste!AE46,AE$6)))","v":""},{"$f":"IF(AF$4=0,\"\",IF(Liste!AF46=\"\",\"\",ROUND(AF$4/Liste!AF$5*Liste!AF46,AF$6)))","v":""},{"$f":"IF(AG$4=0,\"\",IF(Liste!AG46=\"\",\"\",ROUND(AG$4/Liste!AG$5*Liste!AG46,AG$6)))","v":""},{"$f":"IF(AH$4=0,\"\",IF(Liste!AH46=\"\",\"\",ROUND(AH$4/Liste!AH$5*Liste!AH46,AH$6)))","v":""}]
["",{"$f":"IF(Liste!B47=\"\",\"\",Liste!B47)","v":"Gewürznelken"},{"$f":"IF(Liste!C47=\"\",\"\",Liste!C47)","v":"gemahlen"},{"$f":"IF(Liste!D47=\"\",\"\",Liste!D47)","v":"[Tl.]"},{"$f":"IF(E$4=0,\"\",IF(Liste!E47=\"\",\"\",ROUND(E$4/Liste!E$5*Liste!E47,E$6)))","v":""},{"$f":"IF(F$4=0,\"\",IF(Liste!F47=\"\",\"\",ROUND(F$4/Liste!F$5*Liste!F47,F$6)))","v":""},{"$f":"IF(G$4=0,\"\",IF(Liste!G47=\"\",\"\",ROUND(G$4/Liste!G$5*Liste!G47,G$6)))","v":""},{"$f":"IF(H$4=0,\"\",IF(Liste!H47=\"\",\"\",ROUND(H$4/Liste!H$5*Liste!H47,H$6)))","v":""},{"$f":"IF(I$4=0,\"\",IF(Liste!I47=\"\",\"\",ROUND(I$4/Liste!I$5*Liste!I47,I$6)))","v":""},{"$f":"IF(J$4=0,\"\",IF(Liste!J47=\"\",\"\",ROUND(J$4/Liste!J$5*Liste!J47,J$6)))","v":""},{"$f":"IF(K$4=0,\"\",IF(Liste!K47=\"\",\"\",ROUND(K$4/Liste!K$5*Liste!K47,K$6)))","v":""},{"$f":"IF(L$4=0,\"\",IF(Liste!L47=\"\",\"\",ROUND(L$4/Liste!L$5*Liste!L47,L$6)))","v":""},{"$f":"IF(M$4=0,\"\",IF(Liste!M47=\"\",\"\",ROUND(M$4/Liste!M$5*Liste!M47,M$6)))","v":""},{"$f":"IF(N$4=0,\"\",IF(Liste!N47=\"\",\"\",ROUND(N$4/Liste!N$5*Liste!N47,N$6)))","v":""},{"$f":"IF(O$4=0,\"\",IF(Liste!O47=\"\",\"\",ROUND(O$4/Liste!O$5*Liste!O47,O$6)))","v":""},{"$f":"IF(P$4=0,\"\",IF(Liste!P47=\"\",\"\",ROUND(P$4/Liste!P$5*Liste!P47,P$6)))","v":""},{"$f":"IF(Q$4=0,\"\",IF(Liste!Q47=\"\",\"\",ROUND(Q$4/Liste!Q$5*Liste!Q47,Q$6)))","v":""},{"$f":"IF(R$4=0,\"\",IF(Liste!R47=\"\",\"\",ROUND(R$4/Liste!R$5*Liste!R47,R$6)))","v":""},{"$f":"IF(S$4=0,\"\",IF(Liste!S47=\"\",\"\",ROUND(S$4/Liste!S$5*Liste!S47,S$6)))","v":""},{"$f":"IF(T$4=0,\"\",IF(Liste!T47=\"\",\"\",ROUND(T$4/Liste!T$5*Liste!T47,T$6)))","v":""},{"$f":"IF(U$4=0,\"\",IF(Liste!U47=\"\",\"\",ROUND(U$4/Liste!U$5*Liste!U47,U$6)))","v":""},{"$f":"IF(V$4=0,\"\",IF(Liste!V47=\"\",\"\",ROUND(V$4/Liste!V$5*Liste!V47,V$6)))","v":""},{"$f":"IF(W$4=0,\"\",IF(Liste!W47=\"\",\"\",ROUND(W$4/Liste!W$5*Liste!W47,W$6)))","v":""},{"$f":"IF(X$4=0,\"\",IF(Liste!X47=\"\",\"\",ROUND(X$4/Liste!X$5*Liste!X47,X$6)))","v":""},{"$f":"IF(Y$4=0,\"\",IF(Liste!Y47=\"\",\"\",ROUND(Y$4/Liste!Y$5*Liste!Y47,Y$6)))","v":""},{"$f":"IF(Z$4=0,\"\",IF(Liste!Z47=\"\",\"\",ROUND(Z$4/Liste!Z$5*Liste!Z47,Z$6)))","v":""},{"$f":"IF(AA$4=0,\"\",IF(Liste!AA47=\"\",\"\",ROUND(AA$4/Liste!AA$5*Liste!AA47,AA$6)))","v":""},{"$f":"IF(AB$4=0,\"\",IF(Liste!AB47=\"\",\"\",ROUND(AB$4/Liste!AB$5*Liste!AB47,AB$6)))","v":""},{"$f":"IF(AC$4=0,\"\",IF(Liste!AC47=\"\",\"\",ROUND(AC$4/Liste!AC$5*Liste!AC47,AC$6)))","v":""},{"$f":"IF(AD$4=0,\"\",IF(Liste!AD47=\"\",\"\",ROUND(AD$4/Liste!AD$5*Liste!AD47,AD$6)))","v":""},{"$f":"IF(AE$4=0,\"\",IF(Liste!AE47=\"\",\"\",ROUND(AE$4/Liste!AE$5*Liste!AE47,AE$6)))","v":""},{"$f":"IF(AF$4=0,\"\",IF(Liste!AF47=\"\",\"\",ROUND(AF$4/Liste!AF$5*Liste!AF47,AF$6)))","v":""},{"$f":"IF(AG$4=0,\"\",IF(Liste!AG47=\"\",\"\",ROUND(AG$4/Liste!AG$5*Liste!AG47,AG$6)))","v":""},{"$f":"IF(AH$4=0,\"\",IF(Liste!AH47=\"\",\"\",ROUND(AH$4/Liste!AH$5*Liste!AH47,AH$6)))","v":""}]
["",{"$f":"IF(Liste!B48=\"\",\"\",Liste!B48)","v":"Zimt"},{"$f":"IF(Liste!C48=\"\",\"\",Liste!C48)","v":"gemahlen"},{"$f":"IF(Liste!D48=\"\",\"\",Liste!D48)","v":"[Tl.]"},{"$f":"IF(E$4=0,\"\",IF(Liste!E48=\"\",\"\",ROUND(E$4/Liste!E$5*Liste!E48,E$6)))","v":""},{"$f":"IF(F$4=0,\"\",IF(Liste!F48=\"\",\"\",ROUND(F$4/Liste!F$5*Liste!F48,F$6)))","v":""},{"$f":"IF(G$4=0,\"\",IF(Liste!G48=\"\",\"\",ROUND(G$4/Liste!G$5*Liste!G48,G$6)))","v":""},{"$f":"IF(H$4=0,\"\",IF(Liste!H48=\"\",\"\",ROUND(H$4/Liste!H$5*Liste!H48,H$6)))","v":""},{"$f":"IF(I$4=0,\"\",IF(Liste!I48=\"\",\"\",ROUND(I$4/Liste!I$5*Liste!I48,I$6)))","v":""},{"$f":"IF(J$4=0,\"\",IF(Liste!J48=\"\",\"\",ROUND(J$4/Liste!J$5*Liste!J48,J$6)))","v":""},{"$f":"IF(K$4=0,\"\",IF(Liste!K48=\"\",\"\",ROUND(K$4/Liste!K$5*Liste!K48,K$6)))","v":""},{"$f":"IF(L$4=0,\"\",IF(Liste!L48=\"\",\"\",ROUND(L$4/Liste!L$5*Liste!L48,L$6)))","v":""},{"$f":"IF(M$4=0,\"\",IF(Liste!M48=\"\",\"\",ROUND(M$4/Liste!M$5*Liste!M48,M$6)))","v":""},{"$f":"IF(N$4=0,\"\",IF(Liste!N48=\"\",\"\",ROUND(N$4/Liste!N$5*Liste!N48,N$6)))","v":""},{"$f":"IF(O$4=0,\"\",IF(Liste!O48=\"\",\"\",ROUND(O$4/Liste!O$5*Liste!O48,O$6)))","v":""},{"$f":"IF(P$4=0,\"\",IF(Liste!P48=\"\",\"\",ROUND(P$4/Liste!P$5*Liste!P48,P$6)))","v":""},{"$f":"IF(Q$4=0,\"\",IF(Liste!Q48=\"\",\"\",ROUND(Q$4/Liste!Q$5*Liste!Q48,Q$6)))","v":""},{"$f":"IF(R$4=0,\"\",IF(Liste!R48=\"\",\"\",ROUND(R$4/Liste!R$5*Liste!R48,R$6)))","v":""},{"$f":"IF(S$4=0,\"\",IF(Liste!S48=\"\",\"\",ROUND(S$4/Liste!S$5*Liste!S48,S$6)))","v":""},{"$f":"IF(T$4=0,\"\",IF(Liste!T48=\"\",\"\",ROUND(T$4/Liste!T$5*Liste!T48,T$6)))","v":""},{"$f":"IF(U$4=0,\"\",IF(Liste!U48=\"\",\"\",ROUND(U$4/Liste!U$5*Liste!U48,U$6)))","v":""},{"$f":"IF(V$4=0,\"\",IF(Liste!V48=\"\",\"\",ROUND(V$4/Liste!V$5*Liste!V48,V$6)))","v":""},{"$f":"IF(W$4=0,\"\",IF(Liste!W48=\"\",\"\",ROUND(W$4/Liste!W$5*Liste!W48,W$6)))","v":""},{"$f":"IF(X$4=0,\"\",IF(Liste!X48=\"\",\"\",ROUND(X$4/Liste!X$5*Liste!X48,X$6)))","v":""},{"$f":"IF(Y$4=0,\"\",IF(Liste!Y48=\"\",\"\",ROUND(Y$4/Liste!Y$5*Liste!Y48,Y$6)))","v":""},{"$f":"IF(Z$4=0,\"\",IF(Liste!Z48=\"\",\"\",ROUND(Z$4/Liste!Z$5*Liste!Z48,Z$6)))","v":""},{"$f":"IF(AA$4=0,\"\",IF(Liste!AA48=\"\",\"\",ROUND(AA$4/Liste!AA$5*Liste!AA48,AA$6)))","v":""},{"$f":"IF(AB$4=0,\"\",IF(Liste!AB48=\"\",\"\",ROUND(AB$4/Liste!AB$5*Liste!AB48,AB$6)))","v":""},{"$f":"IF(AC$4=0,\"\",IF(Liste!AC48=\"\",\"\",ROUND(AC$4/Liste!AC$5*Liste!AC48,AC$6)))","v":""},{"$f":"IF(AD$4=0,\"\",IF(Liste!AD48=\"\",\"\",ROUND(AD$4/Liste!AD$5*Liste!AD48,AD$6)))","v":""},{"$f":"IF(AE$4=0,\"\",IF(Liste!AE48=\"\",\"\",ROUND(AE$4/Liste!AE$5*Liste!AE48,AE$6)))","v":""},{"$f":"IF(AF$4=0,\"\",IF(Liste!AF48=\"\",\"\",ROUND(AF$4/Liste!AF$5*Liste!AF48,AF$6)))","v":""},{"$f":"IF(AG$4=0,\"\",IF(Liste!AG48=\"\",\"\",ROUND(AG$4/Liste!AG$5*Liste!AG48,AG$6)))","v":""},{"$f":"IF(AH$4=0,\"\",IF(Liste!AH48=\"\",\"\",ROUND(AH$4/Liste!AH$5*Liste!AH48,AH$6)))","v":""}]
["",{"$f":"IF(Liste!B49=\"\",\"\",Liste!B49)","v":"Ingverpulver"},{"$f":"IF(Liste!C49=\"\",\"\",Liste!C49)","v":""},{"$f":"IF(Liste!D49=\"\",\"\",Liste!D49)","v":"[Tl.]"},{"$f":"IF(E$4=0,\"\",IF(Liste!E49=\"\",\"\",ROUND(E$4/Liste!E$5*Liste!E49,E$6)))","v":""},{"$f":"IF(F$4=0,\"\",IF(Liste!F49=\"\",\"\",ROUND(F$4/Liste!F$5*Liste!F49,F$6)))","v":""},{"$f":"IF(G$4=0,\"\",IF(Liste!G49=\"\",\"\",ROUND(G$4/Liste!G$5*Liste!G49,G$6)))","v":""},{"$f":"IF(H$4=0,\"\",IF(Liste!H49=\"\",\"\",ROUND(H$4/Liste!H$5*Liste!H49,H$6)))","v":""},{"$f":"IF(I$4=0,\"\",IF(Liste!I49=\"\",\"\",ROUND(I$4/Liste!I$5*Liste!I49,I$6)))","v":""},{"$f":"IF(J$4=0,\"\",IF(Liste!J49=\"\",\"\",ROUND(J$4/Liste!J$5*Liste!J49,J$6)))","v":""},{"$f":"IF(K$4=0,\"\",IF(Liste!K49=\"\",\"\",ROUND(K$4/Liste!K$5*Liste!K49,K$6)))","v":""},{"$f":"IF(L$4=0,\"\",IF(Liste!L49=\"\",\"\",ROUND(L$4/Liste!L$5*Liste!L49,L$6)))","v":""},{"$f":"IF(M$4=0,\"\",IF(Liste!M49=\"\",\"\",ROUND(M$4/Liste!M$5*Liste!M49,M$6)))","v":""},{"$f":"IF(N$4=0,\"\",IF(Liste!N49=\"\",\"\",ROUND(N$4/Liste!N$5*Liste!N49,N$6)))","v":""},{"$f":"IF(O$4=0,\"\",IF(Liste!O49=\"\",\"\",ROUND(O$4/Liste!O$5*Liste!O49,O$6)))","v":""},{"$f":"IF(P$4=0,\"\",IF(Liste!P49=\"\",\"\",ROUND(P$4/Liste!P$5*Liste!P49,P$6)))","v":""},{"$f":"IF(Q$4=0,\"\",IF(Liste!Q49=\"\",\"\",ROUND(Q$4/Liste!Q$5*Liste!Q49,Q$6)))","v":""},{"$f":"IF(R$4=0,\"\",IF(Liste!R49=\"\",\"\",ROUND(R$4/Liste!R$5*Liste!R49,R$6)))","v":""},{"$f":"IF(S$4=0,\"\",IF(Liste!S49=\"\",\"\",ROUND(S$4/Liste!S$5*Liste!S49,S$6)))","v":""},{"$f":"IF(T$4=0,\"\",IF(Liste!T49=\"\",\"\",ROUND(T$4/Liste!T$5*Liste!T49,T$6)))","v":""},{"$f":"IF(U$4=0,\"\",IF(Liste!U49=\"\",\"\",ROUND(U$4/Liste!U$5*Liste!U49,U$6)))","v":""},{"$f":"IF(V$4=0,\"\",IF(Liste!V49=\"\",\"\",ROUND(V$4/Liste!V$5*Liste!V49,V$6)))","v":""},{"$f":"IF(W$4=0,\"\",IF(Liste!W49=\"\",\"\",ROUND(W$4/Liste!W$5*Liste!W49,W$6)))","v":""},{"$f":"IF(X$4=0,\"\",IF(Liste!X49=\"\",\"\",ROUND(X$4/Liste!X$5*Liste!X49,X$6)))","v":""},{"$f":"IF(Y$4=0,\"\",IF(Liste!Y49=\"\",\"\",ROUND(Y$4/Liste!Y$5*Liste!Y49,Y$6)))","v":""},{"$f":"IF(Z$4=0,\"\",IF(Liste!Z49=\"\",\"\",ROUND(Z$4/Liste!Z$5*Liste!Z49,Z$6)))","v":""},{"$f":"IF(AA$4=0,\"\",IF(Liste!AA49=\"\",\"\",ROUND(AA$4/Liste!AA$5*Liste!AA49,AA$6)))","v":""},{"$f":"IF(AB$4=0,\"\",IF(Liste!AB49=\"\",\"\",ROUND(AB$4/Liste!AB$5*Liste!AB49,AB$6)))","v":""},{"$f":"IF(AC$4=0,\"\",IF(Liste!AC49=\"\",\"\",ROUND(AC$4/Liste!AC$5*Liste!AC49,AC$6)))","v":""},{"$f":"IF(AD$4=0,\"\",IF(Liste!AD49=\"\",\"\",ROUND(AD$4/Liste!AD$5*Liste!AD49,AD$6)))","v":""},{"$f":"IF(AE$4=0,\"\",IF(Liste!AE49=\"\",\"\",ROUND(AE$4/Liste!AE$5*Liste!AE49,AE$6)))","v":""},{"$f":"IF(AF$4=0,\"\",IF(Liste!AF49=\"\",\"\",ROUND(AF$4/Liste!AF$5*Liste!AF49,AF$6)))","v":""},{"$f":"IF(AG$4=0,\"\",IF(Liste!AG49=\"\",\"\",ROUND(AG$4/Liste!AG$5*Liste!AG49,AG$6)))","v":""},{"$f":"IF(AH$4=0,\"\",IF(Liste!AH49=\"\",\"\",ROUND(AH$4/Liste!AH$5*Liste!AH49,AH$6)))","v":""}]
["",{"$f":"IF(Liste!B50=\"\",\"\",Liste!B50)","v":"Kardamon"},{"$f":"IF(Liste!C50=\"\",\"\",Liste!C50)","v":""},{"$f":"IF(Liste!D50=\"\",\"\",Liste!D50)","v":"[Tl.]"},{"$f":"IF(E$4=0,\"\",IF(Liste!E50=\"\",\"\",ROUND(E$4/Liste!E$5*Liste!E50,E$6)))","v":""},{"$f":"IF(F$4=0,\"\",IF(Liste!F50=\"\",\"\",ROUND(F$4/Liste!F$5*Liste!F50,F$6)))","v":""},{"$f":"IF(G$4=0,\"\",IF(Liste!G50=\"\",\"\",ROUND(G$4/Liste!G$5*Liste!G50,G$6)))","v":""},{"$f":"IF(H$4=0,\"\",IF(Liste!H50=\"\",\"\",ROUND(H$4/Liste!H$5*Liste!H50,H$6)))","v":""},{"$f":"IF(I$4=0,\"\",IF(Liste!I50=\"\",\"\",ROUND(I$4/Liste!I$5*Liste!I50,I$6)))","v":""},{"$f":"IF(J$4=0,\"\",IF(Liste!J50=\"\",\"\",ROUND(J$4/Liste!J$5*Liste!J50,J$6)))","v":""},{"$f":"IF(K$4=0,\"\",IF(Liste!K50=\"\",\"\",ROUND(K$4/Liste!K$5*Liste!K50,K$6)))","v":""},{"$f":"IF(L$4=0,\"\",IF(Liste!L50=\"\",\"\",ROUND(L$4/Liste!L$5*Liste!L50,L$6)))","v":""},{"$f":"IF(M$4=0,\"\",IF(Liste!M50=\"\",\"\",ROUND(M$4/Liste!M$5*Liste!M50,M$6)))","v":""},{"$f":"IF(N$4=0,\"\",IF(Liste!N50=\"\",\"\",ROUND(N$4/Liste!N$5*Liste!N50,N$6)))","v":""},{"$f":"IF(O$4=0,\"\",IF(Liste!O50=\"\",\"\",ROUND(O$4/Liste!O$5*Liste!O50,O$6)))","v":""},{"$f":"IF(P$4=0,\"\",IF(Liste!P50=\"\",\"\",ROUND(P$4/Liste!P$5*Liste!P50,P$6)))","v":""},{"$f":"IF(Q$4=0,\"\",IF(Liste!Q50=\"\",\"\",ROUND(Q$4/Liste!Q$5*Liste!Q50,Q$6)))","v":""},{"$f":"IF(R$4=0,\"\",IF(Liste!R50=\"\",\"\",ROUND(R$4/Liste!R$5*Liste!R50,R$6)))","v":""},{"$f":"IF(S$4=0,\"\",IF(Liste!S50=\"\",\"\",ROUND(S$4/Liste!S$5*Liste!S50,S$6)))","v":""},{"$f":"IF(T$4=0,\"\",IF(Liste!T50=\"\",\"\",ROUND(T$4/Liste!T$5*Liste!T50,T$6)))","v":""},{"$f":"IF(U$4=0,\"\",IF(Liste!U50=\"\",\"\",ROUND(U$4/Liste!U$5*Liste!U50,U$6)))","v":""},{"$f":"IF(V$4=0,\"\",IF(Liste!V50=\"\",\"\",ROUND(V$4/Liste!V$5*Liste!V50,V$6)))","v":""},{"$f":"IF(W$4=0,\"\",IF(Liste!W50=\"\",\"\",ROUND(W$4/Liste!W$5*Liste!W50,W$6)))","v":""},{"$f":"IF(X$4=0,\"\",IF(Liste!X50=\"\",\"\",ROUND(X$4/Liste!X$5*Liste!X50,X$6)))","v":""},{"$f":"IF(Y$4=0,\"\",IF(Liste!Y50=\"\",\"\",ROUND(Y$4/Liste!Y$5*Liste!Y50,Y$6)))","v":""},{"$f":"IF(Z$4=0,\"\",IF(Liste!Z50=\"\",\"\",ROUND(Z$4/Liste!Z$5*Liste!Z50,Z$6)))","v":""},{"$f":"IF(AA$4=0,\"\",IF(Liste!AA50=\"\",\"\",ROUND(AA$4/Liste!AA$5*Liste!AA50,AA$6)))","v":""},{"$f":"IF(AB$4=0,\"\",IF(Liste!AB50=\"\",\"\",ROUND(AB$4/Liste!AB$5*Liste!AB50,AB$6)))","v":""},{"$f":"IF(AC$4=0,\"\",IF(Liste!AC50=\"\",\"\",ROUND(AC$4/Liste!AC$5*Liste!AC50,AC$6)))","v":""},{"$f":"IF(AD$4=0,\"\",IF(Liste!AD50=\"\",\"\",ROUND(AD$4/Liste!AD$5*Liste!AD50,AD$6)))","v":""},{"$f":"IF(AE$4=0,\"\",IF(Liste!AE50=\"\",\"\",ROUND(AE$4/Liste!AE$5*Liste!AE50,AE$6)))","v":""},{"$f":"IF(AF$4=0,\"\",IF(Liste!AF50=\"\",\"\",ROUND(AF$4/Liste!AF$5*Liste!AF50,AF$6)))","v":""},{"$f":"IF(AG$4=0,\"\",IF(Liste!AG50=\"\",\"\",ROUND(AG$4/Liste!AG$5*Liste!AG50,AG$6)))","v":""},{"$f":"IF(AH$4=0,\"\",IF(Liste!AH50=\"\",\"\",ROUND(AH$4/Liste!AH$5*Liste!AH50,AH$6)))","v":""}]
[4,{"$f":"IF(Liste!B51=\"\",\"\",Liste!B51)","v":"Backpulver"},{"$f":"IF(Liste!C51=\"\",\"\",Liste!C51)","v":""},{"$f":"IF(Liste!D51=\"\",\"\",Liste!D51)","v":"[Tl.]"},{"$f":"IF(E$4=0,\"\",IF(Liste!E51=\"\",\"\",ROUND(E$4/Liste!E$5*Liste!E51,E$6)))","v":""},{"$f":"IF(F$4=0,\"\",IF(Liste!F51=\"\",\"\",ROUND(F$4/Liste!F$5*Liste!F51,F$6)))","v":""},{"$f":"IF(G$4=0,\"\",IF(Liste!G51=\"\",\"\",ROUND(G$4/Liste!G$5*Liste!G51,G$6)))","v":""},{"$f":"IF(H$4=0,\"\",IF(Liste!H51=\"\",\"\",ROUND(H$4/Liste!H$5*Liste!H51,H$6)))","v":""},{"$f":"IF(I$4=0,\"\",IF(Liste!I51=\"\",\"\",ROUND(I$4/Liste!I$5*Liste!I51,I$6)))","v":""},{"$f":"IF(J$4=0,\"\",IF(Liste!J51=\"\",\"\",ROUND(J$4/Liste!J$5*Liste!J51,J$6)))","v":""},{"$f":"IF(K$4=0,\"\",IF(Liste!K51=\"\",\"\",ROUND(K$4/Liste!K$5*Liste!K51,K$6)))","v":1},{"$f":"IF(L$4=0,\"\",IF(Liste!L51=\"\",\"\",ROUND(L$4/Liste!L$5*Liste!L51,L$6)))","v":1},{"$f":"IF(M$4=0,\"\",IF(Liste!M51=\"\",\"\",ROUND(M$4/Liste!M$5*Liste!M51,M$6)))","v":""},{"$f":"IF(N$4=0,\"\",IF(Liste!N51=\"\",\"\",ROUND(N$4/Liste!N$5*Liste!N51,N$6)))","v":""},{"$f":"IF(O$4=0,\"\",IF(Liste!O51=\"\",\"\",ROUND(O$4/Liste!O$5*Liste!O51,O$6)))","v":1},{"$f":"IF(P$4=0,\"\",IF(Liste!P51=\"\",\"\",ROUND(P$4/Liste!P$5*Liste!P51,P$6)))","v":""},{"$f":"IF(Q$4=0,\"\",IF(Liste!Q51=\"\",\"\",ROUND(Q$4/Liste!Q$5*Liste!Q51,Q$6)))","v":""},{"$f":"IF(R$4=0,\"\",IF(Liste!R51=\"\",\"\",ROUND(R$4/Liste!R$5*Liste!R51,R$6)))","v":""},{"$f":"IF(S$4=0,\"\",IF(Liste!S51=\"\",\"\",ROUND(S$4/Liste!S$5*Liste!S51,S$6)))","v":""},{"$f":"IF(T$4=0,\"\",IF(Liste!T51=\"\",\"\",ROUND(T$4/Liste!T$5*Liste!T51,T$6)))","v":""},{"$f":"IF(U$4=0,\"\",IF(Liste!U51=\"\",\"\",ROUND(U$4/Liste!U$5*Liste!U51,U$6)))","v":""},{"$f":"IF(V$4=0,\"\",IF(Liste!V51=\"\",\"\",ROUND(V$4/Liste!V$5*Liste!V51,V$6)))","v":""},{"$f":"IF(W$4=0,\"\",IF(Liste!W51=\"\",\"\",ROUND(W$4/Liste!W$5*Liste!W51,W$6)))","v":""},{"$f":"IF(X$4=0,\"\",IF(Liste!X51=\"\",\"\",ROUND(X$4/Liste!X$5*Liste!X51,X$6)))","v":1},{"$f":"IF(Y$4=0,\"\",IF(Liste!Y51=\"\",\"\",ROUND(Y$4/Liste!Y$5*Liste!Y51,Y$6)))","v":""},{"$f":"IF(Z$4=0,\"\",IF(Liste!Z51=\"\",\"\",ROUND(Z$4/Liste!Z$5*Liste!Z51,Z$6)))","v":""},{"$f":"IF(AA$4=0,\"\",IF(Liste!AA51=\"\",\"\",ROUND(AA$4/Liste!AA$5*Liste!AA51,AA$6)))","v":""},{"$f":"IF(AB$4=0,\"\",IF(Liste!AB51=\"\",\"\",ROUND(AB$4/Liste!AB$5*Liste!AB51,AB$6)))","v":""},{"$f":"IF(AC$4=0,\"\",IF(Liste!AC51=\"\",\"\",ROUND(AC$4/Liste!AC$5*Liste!AC51,AC$6)))","v":""},{"$f":"IF(AD$4=0,\"\",IF(Liste!AD51=\"\",\"\",ROUND(AD$4/Liste!AD$5*Liste!AD51,AD$6)))","v":""},{"$f":"IF(AE$4=0,\"\",IF(Liste!AE51=\"\",\"\",ROUND(AE$4/Liste!AE$5*Liste!AE51,AE$6)))","v":""},{"$f":"IF(AF$4=0,\"\",IF(Liste!AF51=\"\",\"\",ROUND(AF$4/Liste!AF$5*Liste!AF51,AF$6)))","v":""},{"$f":"IF(AG$4=0,\"\",IF(Liste!AG51=\"\",\"\",ROUND(AG$4/Liste!AG$5*Liste!AG51,AG$6)))","v":""},{"$f":"IF(AH$4=0,\"\",IF(Liste!AH51=\"\",\"\",ROUND(AH$4/Liste!AH$5*Liste!AH51,AH$6)))","v":""}]
["",{"$f":"IF(Liste!B52=\"\",\"\",Liste!B52)","v":"Milch"},{"$f":"IF(Liste!C52=\"\",\"\",Liste!C52)","v":""},{"$f":"IF(Liste!D52=\"\",\"\",Liste!D52)","v":"[Eßl.]"},{"$f":"IF(E$4=0,\"\",IF(Liste!E52=\"\",\"\",ROUND(E$4/Liste!E$5*Liste!E52,E$6)))","v":""},{"$f":"IF(F$4=0,\"\",IF(Liste!F52=\"\",\"\",ROUND(F$4/Liste!F$5*Liste!F52,F$6)))","v":""},{"$f":"IF(G$4=0,\"\",IF(Liste!G52=\"\",\"\",ROUND(G$4/Liste!G$5*Liste!G52,G$6)))","v":""},{"$f":"IF(H$4=0,\"\",IF(Liste!H52=\"\",\"\",ROUND(H$4/Liste!H$5*Liste!H52,H$6)))","v":""},{"$f":"IF(I$4=0,\"\",IF(Liste!I52=\"\",\"\",ROUND(I$4/Liste!I$5*Liste!I52,I$6)))","v":""},{"$f":"IF(J$4=0,\"\",IF(Liste!J52=\"\",\"\",ROUND(J$4/Liste!J$5*Liste!J52,J$6)))","v":""},{"$f":"IF(K$4=0,\"\",IF(Liste!K52=\"\",\"\",ROUND(K$4/Liste!K$5*Liste!K52,K$6)))","v":""},{"$f":"IF(L$4=0,\"\",IF(Liste!L52=\"\",\"\",ROUND(L$4/Liste!L$5*Liste!L52,L$6)))","v":""},{"$f":"IF(M$4=0,\"\",IF(Liste!M52=\"\",\"\",ROUND(M$4/Liste!M$5*Liste!M52,M$6)))","v":""},{"$f":"IF(N$4=0,\"\",IF(Liste!N52=\"\",\"\",ROUND(N$4/Liste!N$5*Liste!N52,N$6)))","v":""},{"$f":"IF(O$4=0,\"\",IF(Liste!O52=\"\",\"\",ROUND(O$4/Liste!O$5*Liste!O52,O$6)))","v":""},{"$f":"IF(P$4=0,\"\",IF(Liste!P52=\"\",\"\",ROUND(P$4/Liste!P$5*Liste!P52,P$6)))","v":""},{"$f":"IF(Q$4=0,\"\",IF(Liste!Q52=\"\",\"\",ROUND(Q$4/Liste!Q$5*Liste!Q52,Q$6)))","v":""},{"$f":"IF(R$4=0,\"\",IF(Liste!R52=\"\",\"\",ROUND(R$4/Liste!R$5*Liste!R52,R$6)))","v":""},{"$f":"IF(S$4=0,\"\",IF(Liste!S52=\"\",\"\",ROUND(S$4/Liste!S$5*Liste!S52,S$6)))","v":""},{"$f":"IF(T$4=0,\"\",IF(Liste!T52=\"\",\"\",ROUND(T$4/Liste!T$5*Liste!T52,T$6)))","v":""},{"$f":"IF(U$4=0,\"\",IF(Liste!U52=\"\",\"\",ROUND(U$4/Liste!U$5*Liste!U52,U$6)))","v":""},{"$f":"IF(V$4=0,\"\",IF(Liste!V52=\"\",\"\",ROUND(V$4/Liste!V$5*Liste!V52,V$6)))","v":""},{"$f":"IF(W$4=0,\"\",IF(Liste!W52=\"\",\"\",ROUND(W$4/Liste!W$5*Liste!W52,W$6)))","v":""},{"$f":"IF(X$4=0,\"\",IF(Liste!X52=\"\",\"\",ROUND(X$4/Liste!X$5*Liste!X52,X$6)))","v":""},{"$f":"IF(Y$4=0,\"\",IF(Liste!Y52=\"\",\"\",ROUND(Y$4/Liste!Y$5*Liste!Y52,Y$6)))","v":""},{"$f":"IF(Z$4=0,\"\",IF(Liste!Z52=\"\",\"\",ROUND(Z$4/Liste!Z$5*Liste!Z52,Z$6)))","v":""},{"$f":"IF(AA$4=0,\"\",IF(Liste!AA52=\"\",\"\",ROUND(AA$4/Liste!AA$5*Liste!AA52,AA$6)))","v":""},{"$f":"IF(AB$4=0,\"\",IF(Liste!AB52=\"\",\"\",ROUND(AB$4/Liste!AB$5*Liste!AB52,AB$6)))","v":""},{"$f":"IF(AC$4=0,\"\",IF(Liste!AC52=\"\",\"\",ROUND(AC$4/Liste!AC$5*Liste!AC52,AC$6)))","v":""},{"$f":"IF(AD$4=0,\"\",IF(Liste!AD52=\"\",\"\",ROUND(AD$4/Liste!AD$5*Liste!AD52,AD$6)))","v":""},{"$f":"IF(AE$4=0,\"\",IF(Liste!AE52=\"\",\"\",ROUND(AE$4/Liste!AE$5*Liste!AE52,AE$6)))","v":""},{"$f":"IF(AF$4=0,\"\",IF(Liste!AF52=\"\",\"\",ROUND(AF$4/Liste!AF$5*Liste!AF52,AF$6)))","v":""},{"$f":"IF(AG$4=0,\"\",IF(Liste!AG52=\"\",\"\",ROUND(AG$4/Liste!AG$5*Liste!AG52,AG$6)))","v":""},{"$f":"IF(AH$4=0,\"\",IF(Liste!AH52=\"\",\"\",ROUND(AH$4/Liste!AH$5*Liste!AH52,AH$6)))","v":""}]
[100,{"$f":"IF(Liste!B53=\"\",\"\",Liste!B53)","v":"Sahne"},{"$f":"IF(Liste!C53=\"\",\"\",Liste!C53)","v":"(1 Eß = 15 ml = 10 g)"},{"$f":"IF(Liste!D53=\"\",\"\",Liste!D53)","v":"[g]"},{"$f":"IF(E$4=0,\"\",IF(Liste!E53=\"\",\"\",ROUND(E$4/Liste!E$5*Liste!E53,E$6)))","v":""},{"$f":"IF(F$4=0,\"\",IF(Liste!F53=\"\",\"\",ROUND(F$4/Liste!F$5*Liste!F53,F$6)))","v":""},{"$f":"IF(G$4=0,\"\",IF(Liste!G53=\"\",\"\",ROUND(G$4/Liste!G$5*Liste!G53,G$6)))","v":""},{"$f":"IF(H$4=0,\"\",IF(Liste!H53=\"\",\"\",ROUND(H$4/Liste!H$5*Liste!H53,H$6)))","v":""},{"$f":"IF(I$4=0,\"\",IF(Liste!I53=\"\",\"\",ROUND(I$4/Liste!I$5*Liste!I53,I$6)))","v":""},{"$f":"IF(J$4=0,\"\",IF(Liste!J53=\"\",\"\",ROUND(J$4/Liste!J$5*Liste!J53,J$6)))","v":""},{"$f":"IF(K$4=0,\"\",IF(Liste!K53=\"\",\"\",ROUND(K$4/Liste!K$5*Liste!K53,K$6)))","v":""},{"$f":"IF(L$4=0,\"\",IF(Liste!L53=\"\",\"\",ROUND(L$4/Liste!L$5*Liste!L53,L$6)))","v":""},{"$f":"IF(M$4=0,\"\",IF(Liste!M53=\"\",\"\",ROUND(M$4/Liste!M$5*Liste!M53,M$6)))","v":""},{"$f":"IF(N$4=0,\"\",IF(Liste!N53=\"\",\"\",ROUND(N$4/Liste!N$5*Liste!N53,N$6)))","v":""},{"$f":"IF(O$4=0,\"\",IF(Liste!O53=\"\",\"\",ROUND(O$4/Liste!O$5*Liste!O53,O$6)))","v":""},{"$f":"IF(P$4=0,\"\",IF(Liste!P53=\"\",\"\",ROUND(P$4/Liste!P$5*Liste!P53,P$6)))","v":80},{"$f":"IF(Q$4=0,\"\",IF(Liste!Q53=\"\",\"\",ROUND(Q$4/Liste!Q$5*Liste!Q53,Q$6)))","v":""},{"$f":"IF(R$4=0,\"\",IF(Liste!R53=\"\",\"\",ROUND(R$4/Liste!R$5*Liste!R53,R$6)))","v":""},{"$f":"IF(S$4=0,\"\",IF(Liste!S53=\"\",\"\",ROUND(S$4/Liste!S$5*Liste!S53,S$6)))","v":20},{"$f":"IF(T$4=0,\"\",IF(Liste!T53=\"\",\"\",ROUND(T$4/Liste!T$5*Liste!T53,T$6)))","v":""},{"$f":"IF(U$4=0,\"\",IF(Liste!U53=\"\",\"\",ROUND(U$4/Liste!U$5*Liste!U53,U$6)))","v":""},{"$f":"IF(V$4=0,\"\",IF(Liste!V53=\"\",\"\",ROUND(V$4/Liste!V$5*Liste!V53,V$6)))","v":""},{"$f":"IF(W$4=0,\"\",IF(Liste!W53=\"\",\"\",ROUND(W$4/Liste!W$5*Liste!W53,W$6)))","v":""},{"$f":"IF(X$4=0,\"\",IF(Liste!X53=\"\",\"\",ROUND(X$4/Liste!X$5*Liste!X53,X$6)))","v":""},{"$f":"IF(Y$4=0,\"\",IF(Liste!Y53=\"\",\"\",ROUND(Y$4/Liste!Y$5*Liste!Y53,Y$6)))","v":""},{"$f":"IF(Z$4=0,\"\",IF(Liste!Z53=\"\",\"\",ROUND(Z$4/Liste!Z$5*Liste!Z53,Z$6)))","v":""},{"$f":"IF(AA$4=0,\"\",IF(Liste!AA53=\"\",\"\",ROUND(AA$4/Liste!AA$5*Liste!AA53,AA$6)))","v":""},{"$f":"IF(AB$4=0,\"\",IF(Liste!AB53=\"\",\"\",ROUND(AB$4/Liste!AB$5*Liste!AB53,AB$6)))","v":""},{"$f":"IF(AC$4=0,\"\",IF(Liste!AC53=\"\",\"\",ROUND(AC$4/Liste!AC$5*Liste!AC53,AC$6)))","v":""},{"$f":"IF(AD$4=0,\"\",IF(Liste!AD53=\"\",\"\",ROUND(AD$4/Liste!AD$5*Liste!AD53,AD$6)))","v":""},{"$f":"IF(AE$4=0,\"\",IF(Liste!AE53=\"\",\"\",ROUND(AE$4/Liste!AE$5*Liste!AE53,AE$6)))","v":""},{"$f":"IF(AF$4=0,\"\",IF(Liste!AF53=\"\",\"\",ROUND(AF$4/Liste!AF$5*Liste!AF53,AF$6)))","v":""},{"$f":"IF(AG$4=0,\"\",IF(Liste!AG53=\"\",\"\",ROUND(AG$4/Liste!AG$5*Liste!AG53,AG$6)))","v":""},{"$f":"IF(AH$4=0,\"\",IF(Liste!AH53=\"\",\"\",ROUND(AH$4/Liste!AH$5*Liste!AH53,AH$6)))","v":""}]
[3,{"$f":"IF(Liste!B54=\"\",\"\",Liste!B54)","v":"Salz"},{"$f":"IF(Liste!C54=\"\",\"\",Liste!C54)","v":""},{"$f":"IF(Liste!D54=\"\",\"\",Liste!D54)","v":"[Pr.]"},{"$f":"IF(E$4=0,\"\",IF(Liste!E54=\"\",\"\",ROUND(E$4/Liste!E$5*Liste!E54,E$6)))","v":""},{"$f":"IF(F$4=0,\"\",IF(Liste!F54=\"\",\"\",ROUND(F$4/Liste!F$5*Liste!F54,F$6)))","v":""},{"$f":"IF(G$4=0,\"\",IF(Liste!G54=\"\",\"\",ROUND(G$4/Liste!G$5*Liste!G54,G$6)))","v":""},{"$f":"IF(H$4=0,\"\",IF(Liste!H54=\"\",\"\",ROUND(H$4/Liste!H$5*Liste!H54,H$6)))","v":""},{"$f":"IF(I$4=0,\"\",IF(Liste!I54=\"\",\"\",ROUND(I$4/Liste!I$5*Liste!I54,I$6)))","v":""},{"$f":"IF(J$4=0,\"\",IF(Liste!J54=\"\",\"\",ROUND(J$4/Liste!J$5*Liste!J54,J$6)))","v":""},{"$f":"IF(K$4=0,\"\",IF(Liste!K54=\"\",\"\",ROUND(K$4/Liste!K$5*Liste!K54,K$6)))","v":""},{"$f":"IF(L$4=0,\"\",IF(Liste!L54=\"\",\"\",ROUND(L$4/Liste!L$5*Liste!L54,L$6)))","v":1},{"$f":"IF(M$4=0,\"\",IF(Liste!M54=\"\",\"\",ROUND(M$4/Liste!M$5*Liste!M54,M$6)))","v":""},{"$f":"IF(N$4=0,\"\",IF(Liste!N54=\"\",\"\",ROUND(N$4/Liste!N$5*Liste!N54,N$6)))","v":""},{"$f":"IF(O$4=0,\"\",IF(Liste!O54=\"\",\"\",ROUND(O$4/Liste!O$5*Liste!O54,O$6)))","v":""},{"$f":"IF(P$4=0,\"\",IF(Liste!P54=\"\",\"\",ROUND(P$4/Liste!P$5*Liste!P54,P$6)))","v":""},{"$f":"IF(Q$4=0,\"\",IF(Liste!Q54=\"\",\"\",ROUND(Q$4/Liste!Q$5*Liste!Q54,Q$6)))","v":""},{"$f":"IF(R$4=0,\"\",IF(Liste!R54=\"\",\"\",ROUND(R$4/Liste!R$5*Liste!R54,R$6)))","v":""},{"$f":"IF(S$4=0,\"\",IF(Liste!S54=\"\",\"\",ROUND(S$4/Liste!S$5*Liste!S54,S$6)))","v":""},{"$f":"IF(T$4=0,\"\",IF(Liste!T54=\"\",\"\",ROUND(T$4/Liste!T$5*Liste!T54,T$6)))","v":""},{"$f":"IF(U$4=0,\"\",IF(Liste!U54=\"\",\"\",ROUND(U$4/Liste!U$5*Liste!U54,U$6)))","v":""},{"$f":"IF(V$4=0,\"\",IF(Liste!V54=\"\",\"\",ROUND(V$4/Liste!V$5*Liste!V54,V$6)))","v":1},{"$f":"IF(W$4=0,\"\",IF(Liste!W54=\"\",\"\",ROUND(W$4/Liste!W$5*Liste!W54,W$6)))","v":""},{"$f":"IF(X$4=0,\"\",IF(Liste!X54=\"\",\"\",ROUND(X$4/Liste!X$5*Liste!X54,X$6)))","v":1},{"$f":"IF(Y$4=0,\"\",IF(Liste!Y54=\"\",\"\",ROUND(Y$4/Liste!Y$5*Liste!Y54,Y$6)))","v":""},{"$f":"IF(Z$4=0,\"\",IF(Liste!Z54=\"\",\"\",ROUND(Z$4/Liste!Z$5*Liste!Z54,Z$6)))","v":""},{"$f":"IF(AA$4=0,\"\",IF(Liste!AA54=\"\",\"\",ROUND(AA$4/Liste!AA$5*Liste!AA54,AA$6)))","v":""},{"$f":"IF(AB$4=0,\"\",IF(Liste!AB54=\"\",\"\",ROUND(AB$4/Liste!AB$5*Liste!AB54,AB$6)))","v":""},{"$f":"IF(AC$4=0,\"\",IF(Liste!AC54=\"\",\"\",ROUND(AC$4/Liste!AC$5*Liste!AC54,AC$6)))","v":""},{"$f":"IF(AD$4=0,\"\",IF(Liste!AD54=\"\",\"\",ROUND(AD$4/Liste!AD$5*Liste!AD54,AD$6)))","v":""},{"$f":"IF(AE$4=0,\"\",IF(Liste!AE54=\"\",\"\",ROUND(AE$4/Liste!AE$5*Liste!AE54,AE$6)))","v":""},{"$f":"IF(AF$4=0,\"\",IF(Liste!AF54=\"\",\"\",ROUND(AF$4/Liste!AF$5*Liste!AF54,AF$6)))","v":""},{"$f":"IF(AG$4=0,\"\",IF(Liste!AG54=\"\",\"\",ROUND(AG$4/Liste!AG$5*Liste!AG54,AG$6)))","v":""},{"$f":"IF(AH$4=0,\"\",IF(Liste!AH54=\"\",\"\",ROUND(AH$4/Liste!AH$5*Liste!AH54,AH$6)))","v":""}]
["",{"$f":"IF(Liste!B55=\"\",\"\",Liste!B55)","v":"Rum"},{"$f":"IF(Liste!C55=\"\",\"\",Liste!C55)","v":"(Tl = 5 ml)"},{"$f":"IF(Liste!D55=\"\",\"\",Liste!D55)","v":"[cl]"},{"$f":"IF(E$4=0,\"\",IF(Liste!E55=\"\",\"\",ROUND(E$4/Liste!E$5*Liste!E55,E$6)))","v":""},{"$f":"IF(F$4=0,\"\",IF(Liste!F55=\"\",\"\",ROUND(F$4/Liste!F$5*Liste!F55,F$6)))","v":""},{"$f":"IF(G$4=0,\"\",IF(Liste!G55=\"\",\"\",ROUND(G$4/Liste!G$5*Liste!G55,G$6)))","v":""},{"$f":"IF(H$4=0,\"\",IF(Liste!H55=\"\",\"\",ROUND(H$4/Liste!H$5*Liste!H55,H$6)))","v":""},{"$f":"IF(I$4=0,\"\",IF(Liste!I55=\"\",\"\",ROUND(I$4/Liste!I$5*Liste!I55,I$6)))","v":""},{"$f":"IF(J$4=0,\"\",IF(Liste!J55=\"\",\"\",ROUND(J$4/Liste!J$5*Liste!J55,J$6)))","v":""},{"$f":"IF(K$4=0,\"\",IF(Liste!K55=\"\",\"\",ROUND(K$4/Liste!K$5*Liste!K55,K$6)))","v":""},{"$f":"IF(L$4=0,\"\",IF(Liste!L55=\"\",\"\",ROUND(L$4/Liste!L$5*Liste!L55,L$6)))","v":""},{"$f":"IF(M$4=0,\"\",IF(Liste!M55=\"\",\"\",ROUND(M$4/Liste!M$5*Liste!M55,M$6)))","v":""},{"$f":"IF(N$4=0,\"\",IF(Liste!N55=\"\",\"\",ROUND(N$4/Liste!N$5*Liste!N55,N$6)))","v":""},{"$f":"IF(O$4=0,\"\",IF(Liste!O55=\"\",\"\",ROUND(O$4/Liste!O$5*Liste!O55,O$6)))","v":""},{"$f":"IF(P$4=0,\"\",IF(Liste!P55=\"\",\"\",ROUND(P$4/Liste!P$5*Liste!P55,P$6)))","v":""},{"$f":"IF(Q$4=0,\"\",IF(Liste!Q55=\"\",\"\",ROUND(Q$4/Liste!Q$5*Liste!Q55,Q$6)))","v":""},{"$f":"IF(R$4=0,\"\",IF(Liste!R55=\"\",\"\",ROUND(R$4/Liste!R$5*Liste!R55,R$6)))","v":""},{"$f":"IF(S$4=0,\"\",IF(Liste!S55=\"\",\"\",ROUND(S$4/Liste!S$5*Liste!S55,S$6)))","v":""},{"$f":"IF(T$4=0,\"\",IF(Liste!T55=\"\",\"\",ROUND(T$4/Liste!T$5*Liste!T55,T$6)))","v":""},{"$f":"IF(U$4=0,\"\",IF(Liste!U55=\"\",\"\",ROUND(U$4/Liste!U$5*Liste!U55,U$6)))","v":""},{"$f":"IF(V$4=0,\"\",IF(Liste!V55=\"\",\"\",ROUND(V$4/Liste!V$5*Liste!V55,V$6)))","v":""},{"$f":"IF(W$4=0,\"\",IF(Liste!W55=\"\",\"\",ROUND(W$4/Liste!W$5*Liste!W55,W$6)))","v":""},{"$f":"IF(X$4=0,\"\",IF(Liste!X55=\"\",\"\",ROUND(X$4/Liste!X$5*Liste!X55,X$6)))","v":""},{"$f":"IF(Y$4=0,\"\",IF(Liste!Y55=\"\",\"\",ROUND(Y$4/Liste!Y$5*Liste!Y55,Y$6)))","v":""},{"$f":"IF(Z$4=0,\"\",IF(Liste!Z55=\"\",\"\",ROUND(Z$4/Liste!Z$5*Liste!Z55,Z$6)))","v":""},{"$f":"IF(AA$4=0,\"\",IF(Liste!AA55=\"\",\"\",ROUND(AA$4/Liste!AA$5*Liste!AA55,AA$6)))","v":""},{"$f":"IF(AB$4=0,\"\",IF(Liste!AB55=\"\",\"\",ROUND(AB$4/Liste!AB$5*Liste!AB55,AB$6)))","v":""},{"$f":"IF(AC$4=0,\"\",IF(Liste!AC55=\"\",\"\",ROUND(AC$4/Liste!AC$5*Liste!AC55,AC$6)))","v":""},{"$f":"IF(AD$4=0,\"\",IF(Liste!AD55=\"\",\"\",ROUND(AD$4/Liste!AD$5*Liste!AD55,AD$6)))","v":""},{"$f":"IF(AE$4=0,\"\",IF(Liste!AE55=\"\",\"\",ROUND(AE$4/Liste!AE$5*Liste!AE55,AE$6)))","v":""},{"$f":"IF(AF$4=0,\"\",IF(Liste!AF55=\"\",\"\",ROUND(AF$4/Liste!AF$5*Liste!AF55,AF$6)))","v":""},{"$f":"IF(AG$4=0,\"\",IF(Liste!AG55=\"\",\"\",ROUND(AG$4/Liste!AG$5*Liste!AG55,AG$6)))","v":""},{"$f":"IF(AH$4=0,\"\",IF(Liste!AH55=\"\",\"\",ROUND(AH$4/Liste!AH$5*Liste!AH55,AH$6)))","v":""}]
["",{"$f":"IF(Liste!B56=\"\",\"\",Liste!B56)","v":"Hirschhornsalz"},{"$f":"IF(Liste!C56=\"\",\"\",Liste!C56)","v":""},{"$f":"IF(Liste!D56=\"\",\"\",Liste!D56)","v":"[g]"},{"$f":"IF(E$4=0,\"\",IF(Liste!E56=\"\",\"\",ROUND(E$4/Liste!E$5*Liste!E56,E$6)))","v":""},{"$f":"IF(F$4=0,\"\",IF(Liste!F56=\"\",\"\",ROUND(F$4/Liste!F$5*Liste!F56,F$6)))","v":""},{"$f":"IF(G$4=0,\"\",IF(Liste!G56=\"\",\"\",ROUND(G$4/Liste!G$5*Liste!G56,G$6)))","v":""},{"$f":"IF(H$4=0,\"\",IF(Liste!H56=\"\",\"\",ROUND(H$4/Liste!H$5*Liste!H56,H$6)))","v":""},{"$f":"IF(I$4=0,\"\",IF(Liste!I56=\"\",\"\",ROUND(I$4/Liste!I$5*Liste!I56,I$6)))","v":""},{"$f":"IF(J$4=0,\"\",IF(Liste!J56=\"\",\"\",ROUND(J$4/Liste!J$5*Liste!J56,J$6)))","v":""},{"$f":"IF(K$4=0,\"\",IF(Liste!K56=\"\",\"\",ROUND(K$4/Liste!K$5*Liste!K56,K$6)))","v":""},{"$f":"IF(L$4=0,\"\",IF(Liste!L56=\"\",\"\",ROUND(L$4/Liste!L$5*Liste!L56,L$6)))","v":""},{"$f":"IF(M$4=0,\"\",IF(Liste!M56=\"\",\"\",ROUND(M$4/Liste!M$5*Liste!M56,M$6)))","v":""},{"$f":"IF(N$4=0,\"\",IF(Liste!N56=\"\",\"\",ROUND(N$4/Liste!N$5*Liste!N56,N$6)))","v":""},{"$f":"IF(O$4=0,\"\",IF(Liste!O56=\"\",\"\",ROUND(O$4/Liste!O$5*Liste!O56,O$6)))","v":""},{"$f":"IF(P$4=0,\"\",IF(Liste!P56=\"\",\"\",ROUND(P$4/Liste!P$5*Liste!P56,P$6)))","v":""},{"$f":"IF(Q$4=0,\"\",IF(Liste!Q56=\"\",\"\",ROUND(Q$4/Liste!Q$5*Liste!Q56,Q$6)))","v":""},{"$f":"IF(R$4=0,\"\",IF(Liste!R56=\"\",\"\",ROUND(R$4/Liste!R$5*Liste!R56,R$6)))","v":""},{"$f":"IF(S$4=0,\"\",IF(Liste!S56=\"\",\"\",ROUND(S$4/Liste!S$5*Liste!S56,S$6)))","v":""},{"$f":"IF(T$4=0,\"\",IF(Liste!T56=\"\",\"\",ROUND(T$4/Liste!T$5*Liste!T56,T$6)))","v":""},{"$f":"IF(U$4=0,\"\",IF(Liste!U56=\"\",\"\",ROUND(U$4/Liste!U$5*Liste!U56,U$6)))","v":""},{"$f":"IF(V$4=0,\"\",IF(Liste!V56=\"\",\"\",ROUND(V$4/Liste!V$5*Liste!V56,V$6)))","v":""},{"$f":"IF(W$4=0,\"\",IF(Liste!W56=\"\",\"\",ROUND(W$4/Liste!W$5*Liste!W56,W$6)))","v":""},{"$f":"IF(X$4=0,\"\",IF(Liste!X56=\"\",\"\",ROUND(X$4/Liste!X$5*Liste!X56,X$6)))","v":""},{"$f":"IF(Y$4=0,\"\",IF(Liste!Y56=\"\",\"\",ROUND(Y$4/Liste!Y$5*Liste!Y56,Y$6)))","v":""},{"$f":"IF(Z$4=0,\"\",IF(Liste!Z56=\"\",\"\",ROUND(Z$4/Liste!Z$5*Liste!Z56,Z$6)))","v":""},{"$f":"IF(AA$4=0,\"\",IF(Liste!AA56=\"\",\"\",ROUND(AA$4/Liste!AA$5*Liste!AA56,AA$6)))","v":""},{"$f":"IF(AB$4=0,\"\",IF(Liste!AB56=\"\",\"\",ROUND(AB$4/Liste!AB$5*Liste!AB56,AB$6)))","v":""},{"$f":"IF(AC$4=0,\"\",IF(Liste!AC56=\"\",\"\",ROUND(AC$4/Liste!AC$5*Liste!AC56,AC$6)))","v":""},{"$f":"IF(AD$4=0,\"\",IF(Liste!AD56=\"\",\"\",ROUND(AD$4/Liste!AD$5*Liste!AD56,AD$6)))","v":""},{"$f":"IF(AE$4=0,\"\",IF(Liste!AE56=\"\",\"\",ROUND(AE$4/Liste!AE$5*Liste!AE56,AE$6)))","v":""},{"$f":"IF(AF$4=0,\"\",IF(Liste!AF56=\"\",\"\",ROUND(AF$4/Liste!AF$5*Liste!AF56,AF$6)))","v":""},{"$f":"IF(AG$4=0,\"\",IF(Liste!AG56=\"\",\"\",ROUND(AG$4/Liste!AG$5*Liste!AG56,AG$6)))","v":""},{"$f":"IF(AH$4=0,\"\",IF(Liste!AH56=\"\",\"\",ROUND(AH$4/Liste!AH$5*Liste!AH56,AH$6)))","v":""}]
["",{"$f":"IF(Liste!B57=\"\",\"\",Liste!B57)","v":"Muskat"},{"$f":"IF(Liste!C57=\"\",\"\",Liste!C57)","v":""},{"$f":"IF(Liste!D57=\"\",\"\",Liste!D57)","v":"[Tl.]"},{"$f":"IF(E$4=0,\"\",IF(Liste!E57=\"\",\"\",ROUND(E$4/Liste!E$5*Liste!E57,E$6)))","v":""},{"$f":"IF(F$4=0,\"\",IF(Liste!F57=\"\",\"\",ROUND(F$4/Liste!F$5*Liste!F57,F$6)))","v":""},{"$f":"IF(G$4=0,\"\",IF(Liste!G57=\"\",\"\",ROUND(G$4/Liste!G$5*Liste!G57,G$6)))","v":""},{"$f":"IF(H$4=0,\"\",IF(Liste!H57=\"\",\"\",ROUND(H$4/Liste!H$5*Liste!H57,H$6)))","v":""},{"$f":"IF(I$4=0,\"\",IF(Liste!I57=\"\",\"\",ROUND(I$4/Liste!I$5*Liste!I57,I$6)))","v":""},{"$f":"IF(J$4=0,\"\",IF(Liste!J57=\"\",\"\",ROUND(J$4/Liste!J$5*Liste!J57,J$6)))","v":""},{"$f":"IF(K$4=0,\"\",IF(Liste!K57=\"\",\"\",ROUND(K$4/Liste!K$5*Liste!K57,K$6)))","v":""},{"$f":"IF(L$4=0,\"\",IF(Liste!L57=\"\",\"\",ROUND(L$4/Liste!L$5*Liste!L57,L$6)))","v":""},{"$f":"IF(M$4=0,\"\",IF(Liste!M57=\"\",\"\",ROUND(M$4/Liste!M$5*Liste!M57,M$6)))","v":""},{"$f":"IF(N$4=0,\"\",IF(Liste!N57=\"\",\"\",ROUND(N$4/Liste!N$5*Liste!N57,N$6)))","v":""},{"$f":"IF(O$4=0,\"\",IF(Liste!O57=\"\",\"\",ROUND(O$4/Liste!O$5*Liste!O57,O$6)))","v":""},{"$f":"IF(P$4=0,\"\",IF(Liste!P57=\"\",\"\",ROUND(P$4/Liste!P$5*Liste!P57,P$6)))","v":""},{"$f":"IF(Q$4=0,\"\",IF(Liste!Q57=\"\",\"\",ROUND(Q$4/Liste!Q$5*Liste!Q57,Q$6)))","v":""},{"$f":"IF(R$4=0,\"\",IF(Liste!R57=\"\",\"\",ROUND(R$4/Liste!R$5*Liste!R57,R$6)))","v":""},{"$f":"IF(S$4=0,\"\",IF(Liste!S57=\"\",\"\",ROUND(S$4/Liste!S$5*Liste!S57,S$6)))","v":""},{"$f":"IF(T$4=0,\"\",IF(Liste!T57=\"\",\"\",ROUND(T$4/Liste!T$5*Liste!T57,T$6)))","v":""},{"$f":"IF(U$4=0,\"\",IF(Liste!U57=\"\",\"\",ROUND(U$4/Liste!U$5*Liste!U57,U$6)))","v":""},{"$f":"IF(V$4=0,\"\",IF(Liste!V57=\"\",\"\",ROUND(V$4/Liste!V$5*Liste!V57,V$6)))","v":""},{"$f":"IF(W$4=0,\"\",IF(Liste!W57=\"\",\"\",ROUND(W$4/Liste!W$5*Liste!W57,W$6)))","v":""},{"$f":"IF(X$4=0,\"\",IF(Liste!X57=\"\",\"\",ROUND(X$4/Liste!X$5*Liste!X57,X$6)))","v":""},{"$f":"IF(Y$4=0,\"\",IF(Liste!Y57=\"\",\"\",ROUND(Y$4/Liste!Y$5*Liste!Y57,Y$6)))","v":""},{"$f":"IF(Z$4=0,\"\",IF(Liste!Z57=\"\",\"\",ROUND(Z$4/Liste!Z$5*Liste!Z57,Z$6)))","v":""},{"$f":"IF(AA$4=0,\"\",IF(Liste!AA57=\"\",\"\",ROUND(AA$4/Liste!AA$5*Liste!AA57,AA$6)))","v":""},{"$f":"IF(AB$4=0,\"\",IF(Liste!AB57=\"\",\"\",ROUND(AB$4/Liste!AB$5*Liste!AB57,AB$6)))","v":""},{"$f":"IF(AC$4=0,\"\",IF(Liste!AC57=\"\",\"\",ROUND(AC$4/Liste!AC$5*Liste!AC57,AC$6)))","v":""},{"$f":"IF(AD$4=0,\"\",IF(Liste!AD57=\"\",\"\",ROUND(AD$4/Liste!AD$5*Liste!AD57,AD$6)))","v":""},{"$f":"IF(AE$4=0,\"\",IF(Liste!AE57=\"\",\"\",ROUND(AE$4/Liste!AE$5*Liste!AE57,AE$6)))","v":""},{"$f":"IF(AF$4=0,\"\",IF(Liste!AF57=\"\",\"\",ROUND(AF$4/Liste!AF$5*Liste!AF57,AF$6)))","v":""},{"$f":"IF(AG$4=0,\"\",IF(Liste!AG57=\"\",\"\",ROUND(AG$4/Liste!AG$5*Liste!AG57,AG$6)))","v":""},{"$f":"IF(AH$4=0,\"\",IF(Liste!AH57=\"\",\"\",ROUND(AH$4/Liste!AH$5*Liste!AH57,AH$6)))","v":""}]
["",{"$f":"IF(Liste!B58=\"\",\"\",Liste!B58)","v":"Macis"},{"$f":"IF(Liste!C58=\"\",\"\",Liste!C58)","v":""},{"$f":"IF(Liste!D58=\"\",\"\",Liste!D58)","v":"[Pr.]"},{"$f":"IF(E$4=0,\"\",IF(Liste!E58=\"\",\"\",ROUND(E$4/Liste!E$5*Liste!E58,E$6)))","v":""},{"$f":"IF(F$4=0,\"\",IF(Liste!F58=\"\",\"\",ROUND(F$4/Liste!F$5*Liste!F58,F$6)))","v":""},{"$f":"IF(G$4=0,\"\",IF(Liste!G58=\"\",\"\",ROUND(G$4/Liste!G$5*Liste!G58,G$6)))","v":""},{"$f":"IF(H$4=0,\"\",IF(Liste!H58=\"\",\"\",ROUND(H$4/Liste!H$5*Liste!H58,H$6)))","v":""},{"$f":"IF(I$4=0,\"\",IF(Liste!I58=\"\",\"\",ROUND(I$4/Liste!I$5*Liste!I58,I$6)))","v":""},{"$f":"IF(J$4=0,\"\",IF(Liste!J58=\"\",\"\",ROUND(J$4/Liste!J$5*Liste!J58,J$6)))","v":""},{"$f":"IF(K$4=0,\"\",IF(Liste!K58=\"\",\"\",ROUND(K$4/Liste!K$5*Liste!K58,K$6)))","v":""},{"$f":"IF(L$4=0,\"\",IF(Liste!L58=\"\",\"\",ROUND(L$4/Liste!L$5*Liste!L58,L$6)))","v":""},{"$f":"IF(M$4=0,\"\",IF(Liste!M58=\"\",\"\",ROUND(M$4/Liste!M$5*Liste!M58,M$6)))","v":""},{"$f":"IF(N$4=0,\"\",IF(Liste!N58=\"\",\"\",ROUND(N$4/Liste!N$5*Liste!N58,N$6)))","v":""},{"$f":"IF(O$4=0,\"\",IF(Liste!O58=\"\",\"\",ROUND(O$4/Liste!O$5*Liste!O58,O$6)))","v":""},{"$f":"IF(P$4=0,\"\",IF(Liste!P58=\"\",\"\",ROUND(P$4/Liste!P$5*Liste!P58,P$6)))","v":""},{"$f":"IF(Q$4=0,\"\",IF(Liste!Q58=\"\",\"\",ROUND(Q$4/Liste!Q$5*Liste!Q58,Q$6)))","v":""},{"$f":"IF(R$4=0,\"\",IF(Liste!R58=\"\",\"\",ROUND(R$4/Liste!R$5*Liste!R58,R$6)))","v":""},{"$f":"IF(S$4=0,\"\",IF(Liste!S58=\"\",\"\",ROUND(S$4/Liste!S$5*Liste!S58,S$6)))","v":""},{"$f":"IF(T$4=0,\"\",IF(Liste!T58=\"\",\"\",ROUND(T$4/Liste!T$5*Liste!T58,T$6)))","v":""},{"$f":"IF(U$4=0,\"\",IF(Liste!U58=\"\",\"\",ROUND(U$4/Liste!U$5*Liste!U58,U$6)))","v":""},{"$f":"IF(V$4=0,\"\",IF(Liste!V58=\"\",\"\",ROUND(V$4/Liste!V$5*Liste!V58,V$6)))","v":""},{"$f":"IF(W$4=0,\"\",IF(Liste!W58=\"\",\"\",ROUND(W$4/Liste!W$5*Liste!W58,W$6)))","v":""},{"$f":"IF(X$4=0,\"\",IF(Liste!X58=\"\",\"\",ROUND(X$4/Liste!X$5*Liste!X58,X$6)))","v":""},{"$f":"IF(Y$4=0,\"\",IF(Liste!Y58=\"\",\"\",ROUND(Y$4/Liste!Y$5*Liste!Y58,Y$6)))","v":""},{"$f":"IF(Z$4=0,\"\",IF(Liste!Z58=\"\",\"\",ROUND(Z$4/Liste!Z$5*Liste!Z58,Z$6)))","v":""},{"$f":"IF(AA$4=0,\"\",IF(Liste!AA58=\"\",\"\",ROUND(AA$4/Liste!AA$5*Liste!AA58,AA$6)))","v":""},{"$f":"IF(AB$4=0,\"\",IF(Liste!AB58=\"\",\"\",ROUND(AB$4/Liste!AB$5*Liste!AB58,AB$6)))","v":""},{"$f":"IF(AC$4=0,\"\",IF(Liste!AC58=\"\",\"\",ROUND(AC$4/Liste!AC$5*Liste!AC58,AC$6)))","v":""},{"$f":"IF(AD$4=0,\"\",IF(Liste!AD58=\"\",\"\",ROUND(AD$4/Liste!AD$5*Liste!AD58,AD$6)))","v":""},{"$f":"IF(AE$4=0,\"\",IF(Liste!AE58=\"\",\"\",ROUND(AE$4/Liste!AE$5*Liste!AE58,AE$6)))","v":""},{"$f":"IF(AF$4=0,\"\",IF(Liste!AF58=\"\",\"\",ROUND(AF$4/Liste!AF$5*Liste!AF58,AF$6)))","v":""},{"$f":"IF(AG$4=0,\"\",IF(Liste!AG58=\"\",\"\",ROUND(AG$4/Liste!AG$5*Liste!AG58,AG$6)))","v":""},{"$f":"IF(AH$4=0,\"\",IF(Liste!AH58=\"\",\"\",ROUND(AH$4/Liste!AH$5*Liste!AH58,AH$6)))","v":""}]
["",{"$f":"IF(Liste!B59=\"\",\"\",Liste!B59)","v":"Natron"},{"$f":"IF(Liste!C59=\"\",\"\",Liste!C59)","v":""},{"$f":"IF(Liste!D59=\"\",\"\",Liste!D59)","v":"[TL]"},{"$f":"IF(E$4=0,\"\",IF(Liste!E59=\"\",\"\",ROUND(E$4/Liste!E$5*Liste!E59,E$6)))","v":""},{"$f":"IF(F$4=0,\"\",IF(Liste!F59=\"\",\"\",ROUND(F$4/Liste!F$5*Liste!F59,F$6)))","v":""},{"$f":"IF(G$4=0,\"\",IF(Liste!G59=\"\",\"\",ROUND(G$4/Liste!G$5*Liste!G59,G$6)))","v":""},{"$f":"IF(H$4=0,\"\",IF(Liste!H59=\"\",\"\",ROUND(H$4/Liste!H$5*Liste!H59,H$6)))","v":""},{"$f":"IF(I$4=0,\"\",IF(Liste!I59=\"\",\"\",ROUND(I$4/Liste!I$5*Liste!I59,I$6)))","v":""},{"$f":"IF(J$4=0,\"\",IF(Liste!J59=\"\",\"\",ROUND(J$4/Liste!J$5*Liste!J59,J$6)))","v":""},{"$f":"IF(K$4=0,\"\",IF(Liste!K59=\"\",\"\",ROUND(K$4/Liste!K$5*Liste!K59,K$6)))","v":""},{"$f":"IF(L$4=0,\"\",IF(Liste!L59=\"\",\"\",ROUND(L$4/Liste!L$5*Liste!L59,L$6)))","v":""},{"$f":"IF(M$4=0,\"\",IF(Liste!M59=\"\",\"\",ROUND(M$4/Liste!M$5*Liste!M59,M$6)))","v":""},{"$f":"IF(N$4=0,\"\",IF(Liste!N59=\"\",\"\",ROUND(N$4/Liste!N$5*Liste!N59,N$6)))","v":""},{"$f":"IF(O$4=0,\"\",IF(Liste!O59=\"\",\"\",ROUND(O$4/Liste!O$5*Liste!O59,O$6)))","v":""},{"$f":"IF(P$4=0,\"\",IF(Liste!P59=\"\",\"\",ROUND(P$4/Liste!P$5*Liste!P59,P$6)))","v":""},{"$f":"IF(Q$4=0,\"\",IF(Liste!Q59=\"\",\"\",ROUND(Q$4/Liste!Q$5*Liste!Q59,Q$6)))","v":""},{"$f":"IF(R$4=0,\"\",IF(Liste!R59=\"\",\"\",ROUND(R$4/Liste!R$5*Liste!R59,R$6)))","v":""},{"$f":"IF(S$4=0,\"\",IF(Liste!S59=\"\",\"\",ROUND(S$4/Liste!S$5*Liste!S59,S$6)))","v":""},{"$f":"IF(T$4=0,\"\",IF(Liste!T59=\"\",\"\",ROUND(T$4/Liste!T$5*Liste!T59,T$6)))","v":""},{"$f":"IF(U$4=0,\"\",IF(Liste!U59=\"\",\"\",ROUND(U$4/Liste!U$5*Liste!U59,U$6)))","v":""},{"$f":"IF(V$4=0,\"\",IF(Liste!V59=\"\",\"\",ROUND(V$4/Liste!V$5*Liste!V59,V$6)))","v":""},{"$f":"IF(W$4=0,\"\",IF(Liste!W59=\"\",\"\",ROUND(W$4/Liste!W$5*Liste!W59,W$6)))","v":""},{"$f":"IF(X$4=0,\"\",IF(Liste!X59=\"\",\"\",ROUND(X$4/Liste!X$5*Liste!X59,X$6)))","v":""},{"$f":"IF(Y$4=0,\"\",IF(Liste!Y59=\"\",\"\",ROUND(Y$4/Liste!Y$5*Liste!Y59,Y$6)))","v":""},{"$f":"IF(Z$4=0,\"\",IF(Liste!Z59=\"\",\"\",ROUND(Z$4/Liste!Z$5*Liste!Z59,Z$6)))","v":""},{"$f":"IF(AA$4=0,\"\",IF(Liste!AA59=\"\",\"\",ROUND(AA$4/Liste!AA$5*Liste!AA59,AA$6)))","v":""},{"$f":"IF(AB$4=0,\"\",IF(Liste!AB59=\"\",\"\",ROUND(AB$4/Liste!AB$5*Liste!AB59,AB$6)))","v":""},{"$f":"IF(AC$4=0,\"\",IF(Liste!AC59=\"\",\"\",ROUND(AC$4/Liste!AC$5*Liste!AC59,AC$6)))","v":""},{"$f":"IF(AD$4=0,\"\",IF(Liste!AD59=\"\",\"\",ROUND(AD$4/Liste!AD$5*Liste!AD59,AD$6)))","v":""},{"$f":"IF(AE$4=0,\"\",IF(Liste!AE59=\"\",\"\",ROUND(AE$4/Liste!AE$5*Liste!AE59,AE$6)))","v":""},{"$f":"IF(AF$4=0,\"\",IF(Liste!AF59=\"\",\"\",ROUND(AF$4/Liste!AF$5*Liste!AF59,AF$6)))","v":""},{"$f":"IF(AG$4=0,\"\",IF(Liste!AG59=\"\",\"\",ROUND(AG$4/Liste!AG$5*Liste!AG59,AG$6)))","v":""},{"$f":"IF(AH$4=0,\"\",IF(Liste!AH59=\"\",\"\",ROUND(AH$4/Liste!AH$5*Liste!AH59,AH$6)))","v":""}]
[2,{"$f":"IF(Liste!B60=\"\",\"\",Liste!B60)","v":"Buttermandelaroma"},{"$f":"IF(Liste!C60=\"\",\"\",Liste!C60)","v":""},{"$f":"IF(Liste!D60=\"\",\"\",Liste!D60)","v":"[Tr]"},{"$f":"IF(E$4=0,\"\",IF(Liste!E60=\"\",\"\",ROUND(E$4/Liste!E$5*Liste!E60,E$6)))","v":""},{"$f":"IF(F$4=0,\"\",IF(Liste!F60=\"\",\"\",ROUND(F$4/Liste!F$5*Liste!F60,F$6)))","v":""},{"$f":"IF(G$4=0,\"\",IF(Liste!G60=\"\",\"\",ROUND(G$4/Liste!G$5*Liste!G60,G$6)))","v":""},{"$f":"IF(H$4=0,\"\",IF(Liste!H60=\"\",\"\",ROUND(H$4/Liste!H$5*Liste!H60,H$6)))","v":""},{"$f":"IF(I$4=0,\"\",IF(Liste!I60=\"\",\"\",ROUND(I$4/Liste!I$5*Liste!I60,I$6)))","v":""},{"$f":"IF(J$4=0,\"\",IF(Liste!J60=\"\",\"\",ROUND(J$4/Liste!J$5*Liste!J60,J$6)))","v":""},{"$f":"IF(K$4=0,\"\",IF(Liste!K60=\"\",\"\",ROUND(K$4/Liste!K$5*Liste!K60,K$6)))","v":""},{"$f":"IF(L$4=0,\"\",IF(Liste!L60=\"\",\"\",ROUND(L$4/Liste!L$5*Liste!L60,L$6)))","v":""},{"$f":"IF(M$4=0,\"\",IF(Liste!M60=\"\",\"\",ROUND(M$4/Liste!M$5*Liste!M60,M$6)))","v":""},{"$f":"IF(N$4=0,\"\",IF(Liste!N60=\"\",\"\",ROUND(N$4/Liste!N$5*Liste!N60,N$6)))","v":""},{"$f":"IF(O$4=0,\"\",IF(Liste!O60=\"\",\"\",ROUND(O$4/Liste!O$5*Liste!O60,O$6)))","v":""},{"$f":"IF(P$4=0,\"\",IF(Liste!P60=\"\",\"\",ROUND(P$4/Liste!P$5*Liste!P60,P$6)))","v":""},{"$f":"IF(Q$4=0,\"\",IF(Liste!Q60=\"\",\"\",ROUND(Q$4/Liste!Q$5*Liste!Q60,Q$6)))","v":""},{"$f":"IF(R$4=0,\"\",IF(Liste!R60=\"\",\"\",ROUND(R$4/Liste!R$5*Liste!R60,R$6)))","v":""},{"$f":"IF(S$4=0,\"\",IF(Liste!S60=\"\",\"\",ROUND(S$4/Liste!S$5*Liste!S60,S$6)))","v":2},{"$f":"IF(T$4=0,\"\",IF(Liste!T60=\"\",\"\",ROUND(T$4/Liste!T$5*Liste!T60,T$6)))","v":""},{"$f":"IF(U$4=0,\"\",IF(Liste!U60=\"\",\"\",ROUND(U$4/Liste!U$5*Liste!U60,U$6)))","v":""},{"$f":"IF(V$4=0,\"\",IF(Liste!V60=\"\",\"\",ROUND(V$4/Liste!V$5*Liste!V60,V$6)))","v":""},{"$f":"IF(W$4=0,\"\",IF(Liste!W60=\"\",\"\",ROUND(W$4/Liste!W$5*Liste!W60,W$6)))","v":""},{"$f":"IF(X$4=0,\"\",IF(Liste!X60=\"\",\"\",ROUND(X$4/Liste!X$5*Liste!X60,X$6)))","v":""},{"$f":"IF(Y$4=0,\"\",IF(Liste!Y60=\"\",\"\",ROUND(Y$4/Liste!Y$5*Liste!Y60,Y$6)))","v":""},{"$f":"IF(Z$4=0,\"\",IF(Liste!Z60=\"\",\"\",ROUND(Z$4/Liste!Z$5*Liste!Z60,Z$6)))","v":""},{"$f":"IF(AA$4=0,\"\",IF(Liste!AA60=\"\",\"\",ROUND(AA$4/Liste!AA$5*Liste!AA60,AA$6)))","v":""},{"$f":"IF(AB$4=0,\"\",IF(Liste!AB60=\"\",\"\",ROUND(AB$4/Liste!AB$5*Liste!AB60,AB$6)))","v":""},{"$f":"IF(AC$4=0,\"\",IF(Liste!AC60=\"\",\"\",ROUND(AC$4/Liste!AC$5*Liste!AC60,AC$6)))","v":""},{"$f":"IF(AD$4=0,\"\",IF(Liste!AD60=\"\",\"\",ROUND(AD$4/Liste!AD$5*Liste!AD60,AD$6)))","v":""},{"$f":"IF(AE$4=0,\"\",IF(Liste!AE60=\"\",\"\",ROUND(AE$4/Liste!AE$5*Liste!AE60,AE$6)))","v":""},{"$f":"IF(AF$4=0,\"\",IF(Liste!AF60=\"\",\"\",ROUND(AF$4/Liste!AF$5*Liste!AF60,AF$6)))","v":""},{"$f":"IF(AG$4=0,\"\",IF(Liste!AG60=\"\",\"\",ROUND(AG$4/Liste!AG$5*Liste!AG60,AG$6)))","v":""},{"$f":"IF(AH$4=0,\"\",IF(Liste!AH60=\"\",\"\",ROUND(AH$4/Liste!AH$5*Liste!AH60,AH$6)))","v":""}]
["",{"$f":"IF(Liste!B61=\"\",\"\",Liste!B61)","v":""},{"$f":"IF(Liste!C61=\"\",\"\",Liste!C61)","v":""},{"$f":"IF(Liste!D61=\"\",\"\",Liste!D61)","v":""},{"$f":"IF(E$4=0,\"\",IF(Liste!E61=\"\",\"\",ROUND(E$4/Liste!E$5*Liste!E61,E$6)))","v":""},{"$f":"IF(F$4=0,\"\",IF(Liste!F61=\"\",\"\",ROUND(F$4/Liste!F$5*Liste!F61,F$6)))","v":""},{"$f":"IF(G$4=0,\"\",IF(Liste!G61=\"\",\"\",ROUND(G$4/Liste!G$5*Liste!G61,G$6)))","v":""},{"$f":"IF(H$4=0,\"\",IF(Liste!H61=\"\",\"\",ROUND(H$4/Liste!H$5*Liste!H61,H$6)))","v":""},{"$f":"IF(I$4=0,\"\",IF(Liste!I61=\"\",\"\",ROUND(I$4/Liste!I$5*Liste!I61,I$6)))","v":""},{"$f":"IF(J$4=0,\"\",IF(Liste!J61=\"\",\"\",ROUND(J$4/Liste!J$5*Liste!J61,J$6)))","v":""},{"$f":"IF(K$4=0,\"\",IF(Liste!K61=\"\",\"\",ROUND(K$4/Liste!K$5*Liste!K61,K$6)))","v":""},{"$f":"IF(L$4=0,\"\",IF(Liste!L61=\"\",\"\",ROUND(L$4/Liste!L$5*Liste!L61,L$6)))","v":""},{"$f":"IF(M$4=0,\"\",IF(Liste!M61=\"\",\"\",ROUND(M$4/Liste!M$5*Liste!M61,M$6)))","v":""},{"$f":"IF(N$4=0,\"\",IF(Liste!N61=\"\",\"\",ROUND(N$4/Liste!N$5*Liste!N61,N$6)))","v":""},{"$f":"IF(O$4=0,\"\",IF(Liste!O61=\"\",\"\",ROUND(O$4/Liste!O$5*Liste!O61,O$6)))","v":""},{"$f":"IF(P$4=0,\"\",IF(Liste!P61=\"\",\"\",ROUND(P$4/Liste!P$5*Liste!P61,P$6)))","v":""},{"$f":"IF(Q$4=0,\"\",IF(Liste!Q61=\"\",\"\",ROUND(Q$4/Liste!Q$5*Liste!Q61,Q$6)))","v":""},{"$f":"IF(R$4=0,\"\",IF(Liste!R61=\"\",\"\",ROUND(R$4/Liste!R$5*Liste!R61,R$6)))","v":""},{"$f":"IF(S$4=0,\"\",IF(Liste!S61=\"\",\"\",ROUND(S$4/Liste!S$5*Liste!S61,S$6)))","v":""},{"$f":"IF(T$4=0,\"\",IF(Liste!T61=\"\",\"\",ROUND(T$4/Liste!T$5*Liste!T61,T$6)))","v":""},{"$f":"IF(U$4=0,\"\",IF(Liste!U61=\"\",\"\",ROUND(U$4/Liste!U$5*Liste!U61,U$6)))","v":""},{"$f":"IF(V$4=0,\"\",IF(Liste!V61=\"\",\"\",ROUND(V$4/Liste!V$5*Liste!V61,V$6)))","v":""},{"$f":"IF(W$4=0,\"\",IF(Liste!W61=\"\",\"\",ROUND(W$4/Liste!W$5*Liste!W61,W$6)))","v":""},{"$f":"IF(X$4=0,\"\",IF(Liste!X61=\"\",\"\",ROUND(X$4/Liste!X$5*Liste!X61,X$6)))","v":""},{"$f":"IF(Y$4=0,\"\",IF(Liste!Y61=\"\",\"\",ROUND(Y$4/Liste!Y$5*Liste!Y61,Y$6)))","v":""},{"$f":"IF(Z$4=0,\"\",IF(Liste!Z61=\"\",\"\",ROUND(Z$4/Liste!Z$5*Liste!Z61,Z$6)))","v":""},{"$f":"IF(AA$4=0,\"\",IF(Liste!AA61=\"\",\"\",ROUND(AA$4/Liste!AA$5*Liste!AA61,AA$6)))","v":""},{"$f":"IF(AB$4=0,\"\",IF(Liste!AB61=\"\",\"\",ROUND(AB$4/Liste!AB$5*Liste!AB61,AB$6)))","v":""},{"$f":"IF(AC$4=0,\"\",IF(Liste!AC61=\"\",\"\",ROUND(AC$4/Liste!AC$5*Liste!AC61,AC$6)))","v":""},{"$f":"IF(AD$4=0,\"\",IF(Liste!AD61=\"\",\"\",ROUND(AD$4/Liste!AD$5*Liste!AD61,AD$6)))","v":""},{"$f":"IF(AE$4=0,\"\",IF(Liste!AE61=\"\",\"\",ROUND(AE$4/Liste!AE$5*Liste!AE61,AE$6)))","v":""},{"$f":"IF(AF$4=0,\"\",IF(Liste!AF61=\"\",\"\",ROUND(AF$4/Liste!AF$5*Liste!AF61,AF$6)))","v":""},{"$f":"IF(AG$4=0,\"\",IF(Liste!AG61=\"\",\"\",ROUND(AG$4/Liste!AG$5*Liste!AG61,AG$6)))","v":""},{"$f":"IF(AH$4=0,\"\",IF(Liste!AH61=\"\",\"\",ROUND(AH$4/Liste!AH$5*Liste!AH61,AH$6)))","v":""}]
["",{"$f":"IF(Liste!B62=\"\",\"\",Liste!B62)","v":""},{"$f":"IF(Liste!C62=\"\",\"\",Liste!C62)","v":""},{"$f":"IF(Liste!D62=\"\",\"\",Liste!D62)","v":""},{"$f":"IF(E$4=0,\"\",IF(Liste!E62=\"\",\"\",ROUND(E$4/Liste!E$5*Liste!E62,E$6)))","v":""},{"$f":"IF(F$4=0,\"\",IF(Liste!F62=\"\",\"\",ROUND(F$4/Liste!F$5*Liste!F62,F$6)))","v":""},{"$f":"IF(G$4=0,\"\",IF(Liste!G62=\"\",\"\",ROUND(G$4/Liste!G$5*Liste!G62,G$6)))","v":""},{"$f":"IF(H$4=0,\"\",IF(Liste!H62=\"\",\"\",ROUND(H$4/Liste!H$5*Liste!H62,H$6)))","v":""},{"$f":"IF(I$4=0,\"\",IF(Liste!I62=\"\",\"\",ROUND(I$4/Liste!I$5*Liste!I62,I$6)))","v":""},{"$f":"IF(J$4=0,\"\",IF(Liste!J62=\"\",\"\",ROUND(J$4/Liste!J$5*Liste!J62,J$6)))","v":""},{"$f":"IF(K$4=0,\"\",IF(Liste!K62=\"\",\"\",ROUND(K$4/Liste!K$5*Liste!K62,K$6)))","v":""},{"$f":"IF(L$4=0,\"\",IF(Liste!L62=\"\",\"\",ROUND(L$4/Liste!L$5*Liste!L62,L$6)))","v":""},{"$f":"IF(M$4=0,\"\",IF(Liste!M62=\"\",\"\",ROUND(M$4/Liste!M$5*Liste!M62,M$6)))","v":""},{"$f":"IF(N$4=0,\"\",IF(Liste!N62=\"\",\"\",ROUND(N$4/Liste!N$5*Liste!N62,N$6)))","v":""},{"$f":"IF(O$4=0,\"\",IF(Liste!O62=\"\",\"\",ROUND(O$4/Liste!O$5*Liste!O62,O$6)))","v":""},{"$f":"IF(P$4=0,\"\",IF(Liste!P62=\"\",\"\",ROUND(P$4/Liste!P$5*Liste!P62,P$6)))","v":""},{"$f":"IF(Q$4=0,\"\",IF(Liste!Q62=\"\",\"\",ROUND(Q$4/Liste!Q$5*Liste!Q62,Q$6)))","v":""},{"$f":"IF(R$4=0,\"\",IF(Liste!R62=\"\",\"\",ROUND(R$4/Liste!R$5*Liste!R62,R$6)))","v":""},{"$f":"IF(S$4=0,\"\",IF(Liste!S62=\"\",\"\",ROUND(S$4/Liste!S$5*Liste!S62,S$6)))","v":""},{"$f":"IF(T$4=0,\"\",IF(Liste!T62=\"\",\"\",ROUND(T$4/Liste!T$5*Liste!T62,T$6)))","v":""},{"$f":"IF(U$4=0,\"\",IF(Liste!U62=\"\",\"\",ROUND(U$4/Liste!U$5*Liste!U62,U$6)))","v":""},{"$f":"IF(V$4=0,\"\",IF(Liste!V62=\"\",\"\",ROUND(V$4/Liste!V$5*Liste!V62,V$6)))","v":""},{"$f":"IF(W$4=0,\"\",IF(Liste!W62=\"\",\"\",ROUND(W$4/Liste!W$5*Liste!W62,W$6)))","v":""},{"$f":"IF(X$4=0,\"\",IF(Liste!X62=\"\",\"\",ROUND(X$4/Liste!X$5*Liste!X62,X$6)))","v":""},{"$f":"IF(Y$4=0,\"\",IF(Liste!Y62=\"\",\"\",ROUND(Y$4/Liste!Y$5*Liste!Y62,Y$6)))","v":""},{"$f":"IF(Z$4=0,\"\",IF(Liste!Z62=\"\",\"\",ROUND(Z$4/Liste!Z$5*Liste!Z62,Z$6)))","v":""},{"$f":"IF(AA$4=0,\"\",IF(Liste!AA62=\"\",\"\",ROUND(AA$4/Liste!AA$5*Liste!AA62,AA$6)))","v":""},{"$f":"IF(AB$4=0,\"\",IF(Liste!AB62=\"\",\"\",ROUND(AB$4/Liste!AB$5*Liste!AB62,AB$6)))","v":""},{"$f":"IF(AC$4=0,\"\",IF(Liste!AC62=\"\",\"\",ROUND(AC$4/Liste!AC$5*Liste!AC62,AC$6)))","v":""},{"$f":"IF(AD$4=0,\"\",IF(Liste!AD62=\"\",\"\",ROUND(AD$4/Liste!AD$5*Liste!AD62,AD$6)))","v":""},{"$f":"IF(AE$4=0,\"\",IF(Liste!AE62=\"\",\"\",ROUND(AE$4/Liste!AE$5*Liste!AE62,AE$6)))","v":""},{"$f":"IF(AF$4=0,\"\",IF(Liste!AF62=\"\",\"\",ROUND(AF$4/Liste!AF$5*Liste!AF62,AF$6)))","v":""},{"$f":"IF(AG$4=0,\"\",IF(Liste!AG62=\"\",\"\",ROUND(AG$4/Liste!AG$5*Liste!AG62,AG$6)))","v":""},{"$f":"IF(AH$4=0,\"\",IF(Liste!AH62=\"\",\"\",ROUND(AH$4/Liste!AH$5*Liste!AH62,AH$6)))","v":""}]
[{"$f":"IF(SUM(E63:AA63)=0,\"\",SUM(E63:AA63))","v":""},{"$f":"IF(Liste!B68=\"\",\"\",Liste!B68)","v":""},{"$f":"IF(Liste!C68=\"\",\"\",Liste!C68)","v":""},{"$f":"IF(Liste!D68=\"\",\"\",Liste!D68)","v":""},{"$f":"IF(E$4=0,\"\",IF(Liste!E68=\"\",\"\",E$4/Liste!E$5*Liste!E68))","v":""},{"$f":"IF(F$4=0,\"\",IF(Liste!F68=\"\",\"\",F$4/Liste!F$5*Liste!F68))","v":""},{"$f":"IF(G$4=0,\"\",IF(Liste!G68=\"\",\"\",G$4/Liste!G$5*Liste!G68))","v":""},{"$f":"IF(H$4=0,\"\",IF(Liste!H68=\"\",\"\",H$4/Liste!H$5*Liste!H68))","v":""},{"$f":"IF(I$4=0,\"\",IF(Liste!I68=\"\",\"\",I$4/Liste!I$5*Liste!I68))","v":""},{"$f":"IF(J$4=0,\"\",IF(Liste!J68=\"\",\"\",J$4/Liste!J$5*Liste!J68))","v":""},{"$f":"IF(K$4=0,\"\",IF(Liste!K68=\"\",\"\",K$4/Liste!K$5*Liste!K68))","v":""},{"$f":"IF(L$4=0,\"\",IF(Liste!L68=\"\",\"\",L$4/Liste!L$5*Liste!L68))","v":""},{"$f":"IF(M$4=0,\"\",IF(Liste!M68=\"\",\"\",M$4/Liste!M$5*Liste!M68))","v":""},{"$f":"IF(N$4=0,\"\",IF(Liste!N68=\"\",\"\",N$4/Liste!N$5*Liste!N68))","v":""},{"$f":"IF(O$4=0,\"\",IF(Liste!O68=\"\",\"\",O$4/Liste!O$5*Liste!O68))","v":""},{"$f":"IF(P$4=0,\"\",IF(Liste!P68=\"\",\"\",P$4/Liste!P$5*Liste!P68))","v":""},{"$f":"IF(Q$4=0,\"\",IF(Liste!Q68=\"\",\"\",Q$4/Liste!Q$5*Liste!Q68))","v":""}]
["",{"$f":"IF(Liste!B69=\"\",\"\",Liste!B69)","v":""},{"$f":"IF(Liste!C69=\"\",\"\",Liste!C69)","v":""},{"$f":"IF(Liste!D69=\"\",\"\",Liste!D69)","v":""},{"$f":"IF(E$4=0,\"\",IF(Liste!E69=\"\",\"\",E$4/Liste!E$5*Liste!E69))","v":""},{"$f":"IF(F$4=0,\"\",IF(Liste!F69=\"\",\"\",F$4/Liste!F$5*Liste!F69))","v":""},{"$f":"IF(G$4=0,\"\",IF(Liste!G69=\"\",\"\",G$4/Liste!G$5*Liste!G69))","v":""},{"$f":"IF(H$4=0,\"\",IF(Liste!H69=\"\",\"\",H$4/Liste!H$5*Liste!H69))","v":""},{"$f":"IF(I$4=0,\"\",IF(Liste!I69=\"\",\"\",I$4/Liste!I$5*Liste!I69))","v":""},{"$f":"IF(J$4=0,\"\",IF(Liste!J69=\"\",\"\",J$4/Liste!J$5*Liste!J69))","v":""},{"$f":"IF(K$4=0,\"\",IF(Liste!K69=\"\",\"\",K$4/Liste!K$5*Liste!K69))","v":""},{"$f":"IF(L$4=0,\"\",IF(Liste!L69=\"\",\"\",L$4/Liste!L$5*Liste!L69))","v":""},{"$f":"IF(M$4=0,\"\",IF(Liste!M69=\"\",\"\",M$4/Liste!M$5*Liste!M69))","v":""},{"$f":"IF(N$4=0,\"\",IF(Liste!N69=\"\",\"\",N$4/Liste!N$5*Liste!N69))","v":""},{"$f":"IF(O$4=0,\"\",IF(Liste!O69=\"\",\"\",O$4/Liste!O$5*Liste!O69))","v":""},{"$f":"IF(P$4=0,\"\",IF(Liste!P69=\"\",\"\",P$4/Liste!P$5*Liste!P69))","v":""},{"$f":"IF(Q$4=0,\"\",IF(Liste!Q69=\"\",\"\",Q$4/Liste!Q$5*Liste!Q69))","v":""}]
[{"$f":"IF(SUM(E65:H65)=0,\"\",SUM(E65:H65))","v":""},{"$f":"IF(Liste!B70=\"\",\"\",Liste!B70)","v":""},{"$f":"IF(Liste!C70=\"\",\"\",Liste!C70)","v":""},{"$f":"IF(Liste!D70=\"\",\"\",Liste!D70)","v":""},{"$f":"IF(E$4=0,\"\",IF(Liste!E70=\"\",\"\",E$4/Liste!E$5*Liste!E70))","v":""},{"$f":"IF(F$4=0,\"\",IF(Liste!F70=\"\",\"\",F$4/Liste!F$5*Liste!F70))","v":""},{"$f":"IF(G$4=0,\"\",IF(Liste!G70=\"\",\"\",G$4/Liste!G$5*Liste!G70))","v":""},{"$f":"IF(H$4=0,\"\",IF(Liste!H70=\"\",\"\",H$4/Liste!H$5*Liste!H70))","v":""},{"$f":"IF(I$4=0,\"\",IF(Liste!I70=\"\",\"\",I$4/Liste!I$5*Liste!I70))","v":""},{"$f":"IF(J$4=0,\"\",IF(Liste!J70=\"\",\"\",J$4/Liste!J$5*Liste!J70))","v":""},{"$f":"IF(K$4=0,\"\",IF(Liste!K70=\"\",\"\",K$4/Liste!K$5*Liste!K70))","v":""},{"$f":"IF(L$4=0,\"\",IF(Liste!L70=\"\",\"\",L$4/Liste!L$5*Liste!L70))","v":""},{"$f":"IF(M$4=0,\"\",IF(Liste!M70=\"\",\"\",M$4/Liste!M$5*Liste!M70))","v":""},{"$f":"IF(N$4=0,\"\",IF(Liste!N70=\"\",\"\",N$4/Liste!N$5*Liste!N70))","v":""},{"$f":"IF(O$4=0,\"\",IF(Liste!O70=\"\",\"\",O$4/Liste!O$5*Liste!O70))","v":""},{"$f":"IF(P$4=0,\"\",IF(Liste!P70=\"\",\"\",P$4/Liste!P$5*Liste!P70))","v":""},{"$f":"IF(Q$4=0,\"\",IF(Liste!Q70=\"\",\"\",Q$4/Liste!Q$5*Liste!Q70))","v":""}]
["",{"$f":"IF(Liste!B71=\"\",\"\",Liste!B71)","v":""},{"$f":"IF(Liste!C71=\"\",\"\",Liste!C71)","v":""},{"$f":"IF(Liste!D71=\"\",\"\",Liste!D71)","v":""},{"$f":"IF(E$4=0,\"\",IF(Liste!E71=\"\",\"\",E$4/Liste!E$5*Liste!E71))","v":""},{"$f":"IF(F$4=0,\"\",IF(Liste!F71=\"\",\"\",F$4/Liste!F$5*Liste!F71))","v":""},{"$f":"IF(G$4=0,\"\",IF(Liste!G71=\"\",\"\",G$4/Liste!G$5*Liste!G71))","v":""},{"$f":"IF(H$4=0,\"\",IF(Liste!H71=\"\",\"\",H$4/Liste!H$5*Liste!H71))","v":""},{"$f":"IF(I$4=0,\"\",IF(Liste!I71=\"\",\"\",I$4/Liste!I$5*Liste!I71))","v":""},{"$f":"IF(J$4=0,\"\",IF(Liste!J71=\"\",\"\",J$4/Liste!J$5*Liste!J71))","v":""},{"$f":"IF(K$4=0,\"\",IF(Liste!K71=\"\",\"\",K$4/Liste!K$5*Liste!K71))","v":""},{"$f":"IF(L$4=0,\"\",IF(Liste!L71=\"\",\"\",L$4/Liste!L$5*Liste!L71))","v":""},{"$f":"IF(M$4=0,\"\",IF(Liste!M71=\"\",\"\",M$4/Liste!M$5*Liste!M71))","v":""},{"$f":"IF(N$4=0,\"\",IF(Liste!N71=\"\",\"\",N$4/Liste!N$5*Liste!N71))","v":""},{"$f":"IF(O$4=0,\"\",IF(Liste!O71=\"\",\"\",O$4/Liste!O$5*Liste!O71))","v":""},{"$f":"IF(P$4=0,\"\",IF(Liste!P71=\"\",\"\",P$4/Liste!P$5*Liste!P71))","v":""},{"$f":"IF(Q$4=0,\"\",IF(Liste!Q71=\"\",\"\",Q$4/Liste!Q$5*Liste!Q71))","v":""}]
["",{"$f":"IF(Liste!B72=\"\",\"\",Liste!B72)","v":""},{"$f":"IF(Liste!C72=\"\",\"\",Liste!C72)","v":""},{"$f":"IF(Liste!D72=\"\",\"\",Liste!D72)","v":""},{"$f":"IF(E$4=0,\"\",IF(Liste!E72=\"\",\"\",E$4/Liste!E$5*Liste!E72))","v":""},{"$f":"IF(F$4=0,\"\",IF(Liste!F72=\"\",\"\",F$4/Liste!F$5*Liste!F72))","v":""},{"$f":"IF(G$4=0,\"\",IF(Liste!G72=\"\",\"\",G$4/Liste!G$5*Liste!G72))","v":""},{"$f":"IF(H$4=0,\"\",IF(Liste!H72=\"\",\"\",H$4/Liste!H$5*Liste!H72))","v":""},{"$f":"IF(I$4=0,\"\",IF(Liste!I72=\"\",\"\",I$4/Liste!I$5*Liste!I72))","v":""},{"$f":"IF(J$4=0,\"\",IF(Liste!J72=\"\",\"\",J$4/Liste!J$5*Liste!J72))","v":""},{"$f":"IF(K$4=0,\"\",IF(Liste!K72=\"\",\"\",K$4/Liste!K$5*Liste!K72))","v":""},{"$f":"IF(L$4=0,\"\",IF(Liste!L72=\"\",\"\",L$4/Liste!L$5*Liste!L72))","v":""},{"$f":"IF(M$4=0,\"\",IF(Liste!M72=\"\",\"\",M$4/Liste!M$5*Liste!M72))","v":""},{"$f":"IF(N$4=0,\"\",IF(Liste!N72=\"\",\"\",N$4/Liste!N$5*Liste!N72))","v":""},{"$f":"IF(O$4=0,\"\",IF(Liste!O72=\"\",\"\",O$4/Liste!O$5*Liste!O72))","v":""},{"$f":"IF(P$4=0,\"\",IF(Liste!P72=\"\",\"\",P$4/Liste!P$5*Liste!P72))","v":""},{"$f":"IF(Q$4=0,\"\",IF(Liste!Q72=\"\",\"\",Q$4/Liste!Q$5*Liste!Q72))","v":""}]
["",{"$f":"IF(Liste!B73=\"\",\"\",Liste!B73)","v":""},{"$f":"IF(Liste!C73=\"\",\"\",Liste!C73)","v":""},{"$f":"IF(Liste!D73=\"\",\"\",Liste!D73)","v":""},{"$f":"IF(E$4=0,\"\",IF(Liste!E73=\"\",\"\",E$4/Liste!E$5*Liste!E73))","v":""},{"$f":"IF(F$4=0,\"\",IF(Liste!F73=\"\",\"\",F$4/Liste!F$5*Liste!F73))","v":""},{"$f":"IF(G$4=0,\"\",IF(Liste!G73=\"\",\"\",G$4/Liste!G$5*Liste!G73))","v":""},{"$f":"IF(H$4=0,\"\",IF(Liste!H73=\"\",\"\",H$4/Liste!H$5*Liste!H73))","v":""},{"$f":"IF(I$4=0,\"\",IF(Liste!I73=\"\",\"\",I$4/Liste!I$5*Liste!I73))","v":""},{"$f":"IF(J$4=0,\"\",IF(Liste!J73=\"\",\"\",J$4/Liste!J$5*Liste!J73))","v":""},{"$f":"IF(K$4=0,\"\",IF(Liste!K73=\"\",\"\",K$4/Liste!K$5*Liste!K73))","v":""},{"$f":"IF(L$4=0,\"\",IF(Liste!L73=\"\",\"\",L$4/Liste!L$5*Liste!L73))","v":""},{"$f":"IF(M$4=0,\"\",IF(Liste!M73=\"\",\"\",M$4/Liste!M$5*Liste!M73))","v":""},{"$f":"IF(N$4=0,\"\",IF(Liste!N73=\"\",\"\",N$4/Liste!N$5*Liste!N73))","v":""},{"$f":"IF(O$4=0,\"\",IF(Liste!O73=\"\",\"\",O$4/Liste!O$5*Liste!O73))","v":""},{"$f":"IF(P$4=0,\"\",IF(Liste!P73=\"\",\"\",P$4/Liste!P$5*Liste!P73))","v":""},{"$f":"IF(Q$4=0,\"\",IF(Liste!Q73=\"\",\"\",Q$4/Liste!Q$5*Liste!Q73))","v":""}]
["",{"$f":"IF(Liste!B74=\"\",\"\",Liste!B74)","v":""},{"$f":"IF(Liste!C74=\"\",\"\",Liste!C74)","v":""},{"$f":"IF(Liste!D74=\"\",\"\",Liste!D74)","v":""},{"$f":"IF(E$4=0,\"\",IF(Liste!E74=\"\",\"\",E$4/Liste!E$5*Liste!E74))","v":""},{"$f":"IF(F$4=0,\"\",IF(Liste!F74=\"\",\"\",F$4/Liste!F$5*Liste!F74))","v":""},{"$f":"IF(G$4=0,\"\",IF(Liste!G74=\"\",\"\",G$4/Liste!G$5*Liste!G74))","v":""},{"$f":"IF(H$4=0,\"\",IF(Liste!H74=\"\",\"\",H$4/Liste!H$5*Liste!H74))","v":""},{"$f":"IF(I$4=0,\"\",IF(Liste!I74=\"\",\"\",I$4/Liste!I$5*Liste!I74))","v":""},{"$f":"IF(J$4=0,\"\",IF(Liste!J74=\"\",\"\",J$4/Liste!J$5*Liste!J74))","v":""},{"$f":"IF(K$4=0,\"\",IF(Liste!K74=\"\",\"\",K$4/Liste!K$5*Liste!K74))","v":""},{"$f":"IF(L$4=0,\"\",IF(Liste!L74=\"\",\"\",L$4/Liste!L$5*Liste!L74))","v":""},{"$f":"IF(M$4=0,\"\",IF(Liste!M74=\"\",\"\",M$4/Liste!M$5*Liste!M74))","v":""},{"$f":"IF(N$4=0,\"\",IF(Liste!N74=\"\",\"\",N$4/Liste!N$5*Liste!N74))","v":""},{"$f":"IF(O$4=0,\"\",IF(Liste!O74=\"\",\"\",O$4/Liste!O$5*Liste!O74))","v":""},{"$f":"IF(P$4=0,\"\",IF(Liste!P74=\"\",\"\",P$4/Liste!P$5*Liste!P74))","v":""},{"$f":"IF(Q$4=0,\"\",IF(Liste!Q74=\"\",\"\",Q$4/Liste!Q$5*Liste!Q74))","v":""}]
["",{"$f":"IF(Liste!B75=\"\",\"\",Liste!B75)","v":""},{"$f":"IF(Liste!C75=\"\",\"\",Liste!C75)","v":""},{"$f":"IF(Liste!D75=\"\",\"\",Liste!D75)","v":""},{"$f":"IF(E$4=0,\"\",IF(Liste!E75=\"\",\"\",E$4/Liste!E$5*Liste!E75))","v":""},{"$f":"IF(F$4=0,\"\",IF(Liste!F75=\"\",\"\",F$4/Liste!F$5*Liste!F75))","v":""},{"$f":"IF(G$4=0,\"\",IF(Liste!G75=\"\",\"\",G$4/Liste!G$5*Liste!G75))","v":""},{"$f":"IF(H$4=0,\"\",IF(Liste!H75=\"\",\"\",H$4/Liste!H$5*Liste!H75))","v":""},{"$f":"IF(I$4=0,\"\",IF(Liste!I75=\"\",\"\",I$4/Liste!I$5*Liste!I75))","v":""},{"$f":"IF(J$4=0,\"\",IF(Liste!J75=\"\",\"\",J$4/Liste!J$5*Liste!J75))","v":""},{"$f":"IF(K$4=0,\"\",IF(Liste!K75=\"\",\"\",K$4/Liste!K$5*Liste!K75))","v":""},{"$f":"IF(L$4=0,\"\",IF(Liste!L75=\"\",\"\",L$4/Liste!L$5*Liste!L75))","v":""},{"$f":"IF(M$4=0,\"\",IF(Liste!M75=\"\",\"\",M$4/Liste!M$5*Liste!M75))","v":""},{"$f":"IF(N$4=0,\"\",IF(Liste!N75=\"\",\"\",N$4/Liste!N$5*Liste!N75))","v":""},{"$f":"IF(O$4=0,\"\",IF(Liste!O75=\"\",\"\",O$4/Liste!O$5*Liste!O75))","v":""},{"$f":"IF(P$4=0,\"\",IF(Liste!P75=\"\",\"\",P$4/Liste!P$5*Liste!P75))","v":""},{"$f":"IF(Q$4=0,\"\",IF(Liste!Q75=\"\",\"\",Q$4/Liste!Q$5*Liste!Q75))","v":""}]
["",{"$f":"IF(Liste!B76=\"\",\"\",Liste!B76)","v":""},{"$f":"IF(Liste!C76=\"\",\"\",Liste!C76)","v":""},{"$f":"IF(Liste!D76=\"\",\"\",Liste!D76)","v":""},{"$f":"IF(E$4=0,\"\",IF(Liste!E76=\"\",\"\",E$4/Liste!E$5*Liste!E76))","v":""},{"$f":"IF(F$4=0,\"\",IF(Liste!F76=\"\",\"\",F$4/Liste!F$5*Liste!F76))","v":""},{"$f":"IF(G$4=0,\"\",IF(Liste!G76=\"\",\"\",G$4/Liste!G$5*Liste!G76))","v":""},{"$f":"IF(H$4=0,\"\",IF(Liste!H76=\"\",\"\",H$4/Liste!H$5*Liste!H76))","v":""},{"$f":"IF(I$4=0,\"\",IF(Liste!I76=\"\",\"\",I$4/Liste!I$5*Liste!I76))","v":""},{"$f":"IF(J$4=0,\"\",IF(Liste!J76=\"\",\"\",J$4/Liste!J$5*Liste!J76))","v":""},{"$f":"IF(K$4=0,\"\",IF(Liste!K76=\"\",\"\",K$4/Liste!K$5*Liste!K76))","v":""},{"$f":"IF(L$4=0,\"\",IF(Liste!L76=\"\",\"\",L$4/Liste!L$5*Liste!L76))","v":""},{"$f":"IF(M$4=0,\"\",IF(Liste!M76=\"\",\"\",M$4/Liste!M$5*Liste!M76))","v":""},{"$f":"IF(N$4=0,\"\",IF(Liste!N76=\"\",\"\",N$4/Liste!N$5*Liste!N76))","v":""},{"$f":"IF(O$4=0,\"\",IF(Liste!O76=\"\",\"\",O$4/Liste!O$5*Liste!O76))","v":""},{"$f":"IF(P$4=0,\"\",IF(Liste!P76=\"\",\"\",P$4/Liste!P$5*Liste!P76))","v":""},{"$f":"IF(Q$4=0,\"\",IF(Liste!Q76=\"\",\"\",Q$4/Liste!Q$5*Liste!Q76))","v":""}]
[{"$f":"IF(SUM(E72:H72)=0,\"\",SUM(E72:H72))","v":""},{"$f":"IF(Liste!B77=\"\",\"\",Liste!B77)","v":""},{"$f":"IF(Liste!C77=\"\",\"\",Liste!C77)","v":""},{"$f":"IF(Liste!D77=\"\",\"\",Liste!D77)","v":""},{"$f":"IF(E$4=0,\"\",IF(Liste!E77=\"\",\"\",E$4/Liste!E$5*Liste!E77))","v":""},{"$f":"IF(F$4=0,\"\",IF(Liste!F77=\"\",\"\",F$4/Liste!F$5*Liste!F77))","v":""},{"$f":"IF(G$4=0,\"\",IF(Liste!G77=\"\",\"\",G$4/Liste!G$5*Liste!G77))","v":""},{"$f":"IF(H$4=0,\"\",IF(Liste!H77=\"\",\"\",H$4/Liste!H$5*Liste!H77))","v":""},{"$f":"IF(I$4=0,\"\",IF(Liste!I77=\"\",\"\",I$4/Liste!I$5*Liste!I77))","v":""},{"$f":"IF(J$4=0,\"\",IF(Liste!J77=\"\",\"\",J$4/Liste!J$5*Liste!J77))","v":""},{"$f":"IF(K$4=0,\"\",IF(Liste!K77=\"\",\"\",K$4/Liste!K$5*Liste!K77))","v":""},{"$f":"IF(L$4=0,\"\",IF(Liste!L77=\"\",\"\",L$4/Liste!L$5*Liste!L77))","v":""},{"$f":"IF(M$4=0,\"\",IF(Liste!M77=\"\",\"\",M$4/Liste!M$5*Liste!M77))","v":""},{"$f":"IF(N$4=0,\"\",IF(Liste!N77=\"\",\"\",N$4/Liste!N$5*Liste!N77))","v":""},{"$f":"IF(O$4=0,\"\",IF(Liste!O77=\"\",\"\",O$4/Liste!O$5*Liste!O77))","v":""},{"$f":"IF(P$4=0,\"\",IF(Liste!P77=\"\",\"\",P$4/Liste!P$5*Liste!P77))","v":""},{"$f":"IF(Q$4=0,\"\",IF(Liste!Q77=\"\",\"\",Q$4/Liste!Q$5*Liste!Q77))","v":""}]
["",{"$f":"IF(Liste!B78=\"\",\"\",Liste!B78)","v":""},{"$f":"IF(Liste!C78=\"\",\"\",Liste!C78)","v":""},{"$f":"IF(Liste!D78=\"\",\"\",Liste!D78)","v":""},{"$f":"IF(E$4=0,\"\",IF(Liste!E78=\"\",\"\",E$4/Liste!E$5*Liste!E78))","v":""},{"$f":"IF(F$4=0,\"\",IF(Liste!F78=\"\",\"\",F$4/Liste!F$5*Liste!F78))","v":""},{"$f":"IF(G$4=0,\"\",IF(Liste!G78=\"\",\"\",G$4/Liste!G$5*Liste!G78))","v":""},{"$f":"IF(H$4=0,\"\",IF(Liste!H78=\"\",\"\",H$4/Liste!H$5*Liste!H78))","v":""},{"$f":"IF(I$4=0,\"\",IF(Liste!I78=\"\",\"\",I$4/Liste!I$5*Liste!I78))","v":""},{"$f":"IF(J$4=0,\"\",IF(Liste!J78=\"\",\"\",J$4/Liste!J$5*Liste!J78))","v":""},{"$f":"IF(K$4=0,\"\",IF(Liste!K78=\"\",\"\",K$4/Liste!K$5*Liste!K78))","v":""},{"$f":"IF(L$4=0,\"\",IF(Liste!L78=\"\",\"\",L$4/Liste!L$5*Liste!L78))","v":""},{"$f":"IF(M$4=0,\"\",IF(Liste!M78=\"\",\"\",M$4/Liste!M$5*Liste!M78))","v":""},{"$f":"IF(N$4=0,\"\",IF(Liste!N78=\"\",\"\",N$4/Liste!N$5*Liste!N78))","v":""},{"$f":"IF(O$4=0,\"\",IF(Liste!O78=\"\",\"\",O$4/Liste!O$5*Liste!O78))","v":""},{"$f":"IF(P$4=0,\"\",IF(Liste!P78=\"\",\"\",P$4/Liste!P$5*Liste!P78))","v":""},{"$f":"IF(Q$4=0,\"\",IF(Liste!Q78=\"\",\"\",Q$4/Liste!Q$5*Liste!Q78))","v":""}]
["",{"$f":"IF(Liste!B79=\"\",\"\",Liste!B79)","v":""},{"$f":"IF(Liste!C79=\"\",\"\",Liste!C79)","v":""},{"$f":"IF(Liste!D79=\"\",\"\",Liste!D79)","v":""},{"$f":"IF(E$4=0,\"\",IF(Liste!E79=\"\",\"\",E$4/Liste!E$5*Liste!E79))","v":""},{"$f":"IF(F$4=0,\"\",IF(Liste!F79=\"\",\"\",F$4/Liste!F$5*Liste!F79))","v":""},{"$f":"IF(G$4=0,\"\",IF(Liste!G79=\"\",\"\",G$4/Liste!G$5*Liste!G79))","v":""},{"$f":"IF(H$4=0,\"\",IF(Liste!H79=\"\",\"\",H$4/Liste!H$5*Liste!H79))","v":""},{"$f":"IF(I$4=0,\"\",IF(Liste!I79=\"\",\"\",I$4/Liste!I$5*Liste!I79))","v":""},{"$f":"IF(J$4=0,\"\",IF(Liste!J79=\"\",\"\",J$4/Liste!J$5*Liste!J79))","v":""},{"$f":"IF(K$4=0,\"\",IF(Liste!K79=\"\",\"\",K$4/Liste!K$5*Liste!K79))","v":""},{"$f":"IF(L$4=0,\"\",IF(Liste!L79=\"\",\"\",L$4/Liste!L$5*Liste!L79))","v":""},{"$f":"IF(M$4=0,\"\",IF(Liste!M79=\"\",\"\",M$4/Liste!M$5*Liste!M79))","v":""},{"$f":"IF(N$4=0,\"\",IF(Liste!N79=\"\",\"\",N$4/Liste!N$5*Liste!N79))","v":""},{"$f":"IF(O$4=0,\"\",IF(Liste!O79=\"\",\"\",O$4/Liste!O$5*Liste!O79))","v":""},{"$f":"IF(P$4=0,\"\",IF(Liste!P79=\"\",\"\",P$4/Liste!P$5*Liste!P79))","v":""},{"$f":"IF(Q$4=0,\"\",IF(Liste!Q79=\"\",\"\",Q$4/Liste!Q$5*Liste!Q79))","v":""}]
["",{"$f":"IF(Liste!B80=\"\",\"\",Liste!B80)","v":""},{"$f":"IF(Liste!C80=\"\",\"\",Liste!C80)","v":""},{"$f":"IF(Liste!D80=\"\",\"\",Liste!D80)","v":""},{"$f":"IF(E$4=0,\"\",IF(Liste!E80=\"\",\"\",E$4/Liste!E$5*Liste!E80))","v":""},{"$f":"IF(F$4=0,\"\",IF(Liste!F80=\"\",\"\",F$4/Liste!F$5*Liste!F80))","v":""},{"$f":"IF(G$4=0,\"\",IF(Liste!G80=\"\",\"\",G$4/Liste!G$5*Liste!G80))","v":""},{"$f":"IF(H$4=0,\"\",IF(Liste!H80=\"\",\"\",H$4/Liste!H$5*Liste!H80))","v":""},{"$f":"IF(I$4=0,\"\",IF(Liste!I80=\"\",\"\",I$4/Liste!I$5*Liste!I80))","v":""},{"$f":"IF(J$4=0,\"\",IF(Liste!J80=\"\",\"\",J$4/Liste!J$5*Liste!J80))","v":""},{"$f":"IF(K$4=0,\"\",IF(Liste!K80=\"\",\"\",K$4/Liste!K$5*Liste!K80))","v":""},{"$f":"IF(L$4=0,\"\",IF(Liste!L80=\"\",\"\",L$4/Liste!L$5*Liste!L80))","v":""},{"$f":"IF(M$4=0,\"\",IF(Liste!M80=\"\",\"\",M$4/Liste!M$5*Liste!M80))","v":""},{"$f":"IF(N$4=0,\"\",IF(Liste!N80=\"\",\"\",N$4/Liste!N$5*Liste!N80))","v":""},{"$f":"IF(O$4=0,\"\",IF(Liste!O80=\"\",\"\",O$4/Liste!O$5*Liste!O80))","v":""},{"$f":"IF(P$4=0,\"\",IF(Liste!P80=\"\",\"\",P$4/Liste!P$5*Liste!P80))","v":""},{"$f":"IF(Q$4=0,\"\",IF(Liste!Q80=\"\",\"\",Q$4/Liste!Q$5*Liste!Q80))","v":""}]
["",{"$f":"IF(Liste!B81=\"\",\"\",Liste!B81)","v":""},{"$f":"IF(Liste!C81=\"\",\"\",Liste!C81)","v":""},{"$f":"IF(Liste!D81=\"\",\"\",Liste!D81)","v":""},{"$f":"IF(E$4=0,\"\",IF(Liste!E81=\"\",\"\",E$4/Liste!E$5*Liste!E81))","v":""},{"$f":"IF(F$4=0,\"\",IF(Liste!F81=\"\",\"\",F$4/Liste!F$5*Liste!F81))","v":""},{"$f":"IF(G$4=0,\"\",IF(Liste!G81=\"\",\"\",G$4/Liste!G$5*Liste!G81))","v":""},{"$f":"IF(H$4=0,\"\",IF(Liste!H81=\"\",\"\",H$4/Liste!H$5*Liste!H81))","v":""},{"$f":"IF(I$4=0,\"\",IF(Liste!I81=\"\",\"\",I$4/Liste!I$5*Liste!I81))","v":""},{"$f":"IF(J$4=0,\"\",IF(Liste!J81=\"\",\"\",J$4/Liste!J$5*Liste!J81))","v":""},{"$f":"IF(K$4=0,\"\",IF(Liste!K81=\"\",\"\",K$4/Liste!K$5*Liste!K81))","v":""},{"$f":"IF(L$4=0,\"\",IF(Liste!L81=\"\",\"\",L$4/Liste!L$5*Liste!L81))","v":""},{"$f":"IF(M$4=0,\"\",IF(Liste!M81=\"\",\"\",M$4/Liste!M$5*Liste!M81))","v":""},{"$f":"IF(N$4=0,\"\",IF(Liste!N81=\"\",\"\",N$4/Liste!N$5*Liste!N81))","v":""},{"$f":"IF(O$4=0,\"\",IF(Liste!O81=\"\",\"\",O$4/Liste!O$5*Liste!O81))","v":""},{"$f":"IF(P$4=0,\"\",IF(Liste!P81=\"\",\"\",P$4/Liste!P$5*Liste!P81))","v":""},{"$f":"IF(Q$4=0,\"\",IF(Liste!Q81=\"\",\"\",Q$4/Liste!Q$5*Liste!Q81))","v":""}]
["",{"$f":"IF(Liste!B82=\"\",\"\",Liste!B82)","v":""},{"$f":"IF(Liste!C82=\"\",\"\",Liste!C82)","v":""},{"$f":"IF(Liste!D82=\"\",\"\",Liste!D82)","v":""},{"$f":"IF(E$4=0,\"\",IF(Liste!E82=\"\",\"\",E$4/Liste!E$5*Liste!E82))","v":""},{"$f":"IF(F$4=0,\"\",IF(Liste!F82=\"\",\"\",F$4/Liste!F$5*Liste!F82))","v":""},{"$f":"IF(G$4=0,\"\",IF(Liste!G82=\"\",\"\",G$4/Liste!G$5*Liste!G82))","v":""},{"$f":"IF(H$4=0,\"\",IF(Liste!H82=\"\",\"\",H$4/Liste!H$5*Liste!H82))","v":""},{"$f":"IF(I$4=0,\"\",IF(Liste!I82=\"\",\"\",I$4/Liste!I$5*Liste!I82))","v":""},{"$f":"IF(J$4=0,\"\",IF(Liste!J82=\"\",\"\",J$4/Liste!J$5*Liste!J82))","v":""},{"$f":"IF(K$4=0,\"\",IF(Liste!K82=\"\",\"\",K$4/Liste!K$5*Liste!K82))","v":""},{"$f":"IF(L$4=0,\"\",IF(Liste!L82=\"\",\"\",L$4/Liste!L$5*Liste!L82))","v":""},{"$f":"IF(M$4=0,\"\",IF(Liste!M82=\"\",\"\",M$4/Liste!M$5*Liste!M82))","v":""},{"$f":"IF(N$4=0,\"\",IF(Liste!N82=\"\",\"\",N$4/Liste!N$5*Liste!N82))","v":""},{"$f":"IF(O$4=0,\"\",IF(Liste!O82=\"\",\"\",O$4/Liste!O$5*Liste!O82))","v":""},{"$f":"IF(P$4=0,\"\",IF(Liste!P82=\"\",\"\",P$4/Liste!P$5*Liste!P82))","v":""},{"$f":"IF(Q$4=0,\"\",IF(Liste!Q82=\"\",\"\",Q$4/Liste!Q$5*Liste!Q82))","v":""}]
["",{"$f":"IF(Liste!B83=\"\",\"\",Liste!B83)","v":""},{"$f":"IF(Liste!C83=\"\",\"\",Liste!C83)","v":""},{"$f":"IF(Liste!D83=\"\",\"\",Liste!D83)","v":""},{"$f":"IF(E$4=0,\"\",IF(Liste!E83=\"\",\"\",E$4/Liste!E$5*Liste!E83))","v":""},{"$f":"IF(F$4=0,\"\",IF(Liste!F83=\"\",\"\",F$4/Liste!F$5*Liste!F83))","v":""},{"$f":"IF(G$4=0,\"\",IF(Liste!G83=\"\",\"\",G$4/Liste!G$5*Liste!G83))","v":""},{"$f":"IF(H$4=0,\"\",IF(Liste!H83=\"\",\"\",H$4/Liste!H$5*Liste!H83))","v":""},{"$f":"IF(I$4=0,\"\",IF(Liste!I83=\"\",\"\",I$4/Liste!I$5*Liste!I83))","v":""},{"$f":"IF(J$4=0,\"\",IF(Liste!J83=\"\",\"\",J$4/Liste!J$5*Liste!J83))","v":""},{"$f":"IF(K$4=0,\"\",IF(Liste!K83=\"\",\"\",K$4/Liste!K$5*Liste!K83))","v":""},{"$f":"IF(L$4=0,\"\",IF(Liste!L83=\"\",\"\",L$4/Liste!L$5*Liste!L83))","v":""},{"$f":"IF(M$4=0,\"\",IF(Liste!M83=\"\",\"\",M$4/Liste!M$5*Liste!M83))","v":""},{"$f":"IF(N$4=0,\"\",IF(Liste!N83=\"\",\"\",N$4/Liste!N$5*Liste!N83))","v":""},{"$f":"IF(O$4=0,\"\",IF(Liste!O83=\"\",\"\",O$4/Liste!O$5*Liste!O83))","v":""},{"$f":"IF(P$4=0,\"\",IF(Liste!P83=\"\",\"\",P$4/Liste!P$5*Liste!P83))","v":""},{"$f":"IF(Q$4=0,\"\",IF(Liste!Q83=\"\",\"\",Q$4/Liste!Q$5*Liste!Q83))","v":""}]
["",{"$f":"IF(Liste!B84=\"\",\"\",Liste!B84)","v":""},{"$f":"IF(Liste!C84=\"\",\"\",Liste!C84)","v":""},{"$f":"IF(Liste!D84=\"\",\"\",Liste!D84)","v":""},{"$f":"IF(E$4=0,\"\",IF(Liste!E84=\"\",\"\",E$4/Liste!E$5*Liste!E84))","v":""},{"$f":"IF(F$4=0,\"\",IF(Liste!F84=\"\",\"\",F$4/Liste!F$5*Liste!F84))","v":""},{"$f":"IF(G$4=0,\"\",IF(Liste!G84=\"\",\"\",G$4/Liste!G$5*Liste!G84))","v":""},{"$f":"IF(H$4=0,\"\",IF(Liste!H84=\"\",\"\",H$4/Liste!H$5*Liste!H84))","v":""},{"$f":"IF(I$4=0,\"\",IF(Liste!I84=\"\",\"\",I$4/Liste!I$5*Liste!I84))","v":""},{"$f":"IF(J$4=0,\"\",IF(Liste!J84=\"\",\"\",J$4/Liste!J$5*Liste!J84))","v":""},{"$f":"IF(K$4=0,\"\",IF(Liste!K84=\"\",\"\",K$4/Liste!K$5*Liste!K84))","v":""},{"$f":"IF(L$4=0,\"\",IF(Liste!L84=\"\",\"\",L$4/Liste!L$5*Liste!L84))","v":""},{"$f":"IF(M$4=0,\"\",IF(Liste!M84=\"\",\"\",M$4/Liste!M$5*Liste!M84))","v":""},{"$f":"IF(N$4=0,\"\",IF(Liste!N84=\"\",\"\",N$4/Liste!N$5*Liste!N84))","v":""},{"$f":"IF(O$4=0,\"\",IF(Liste!O84=\"\",\"\",O$4/Liste!O$5*Liste!O84))","v":""},{"$f":"IF(P$4=0,\"\",IF(Liste!P84=\"\",\"\",P$4/Liste!P$5*Liste!P84))","v":""},{"$f":"IF(Q$4=0,\"\",IF(Liste!Q84=\"\",\"\",Q$4/Liste!Q$5*Liste!Q84))","v":""}]
["",{"$f":"IF(Liste!B85=\"\",\"\",Liste!B85)","v":""},{"$f":"IF(Liste!C85=\"\",\"\",Liste!C85)","v":""},{"$f":"IF(Liste!D85=\"\",\"\",Liste!D85)","v":""},{"$f":"IF(E$4=0,\"\",IF(Liste!E85=\"\",\"\",E$4/Liste!E$5*Liste!E85))","v":""},{"$f":"IF(F$4=0,\"\",IF(Liste!F85=\"\",\"\",F$4/Liste!F$5*Liste!F85))","v":""},{"$f":"IF(G$4=0,\"\",IF(Liste!G85=\"\",\"\",G$4/Liste!G$5*Liste!G85))","v":""},{"$f":"IF(H$4=0,\"\",IF(Liste!H85=\"\",\"\",H$4/Liste!H$5*Liste!H85))","v":""},{"$f":"IF(I$4=0,\"\",IF(Liste!I85=\"\",\"\",I$4/Liste!I$5*Liste!I85))","v":""},{"$f":"IF(J$4=0,\"\",IF(Liste!J85=\"\",\"\",J$4/Liste!J$5*Liste!J85))","v":""},{"$f":"IF(K$4=0,\"\",IF(Liste!K85=\"\",\"\",K$4/Liste!K$5*Liste!K85))","v":""},{"$f":"IF(L$4=0,\"\",IF(Liste!L85=\"\",\"\",L$4/Liste!L$5*Liste!L85))","v":""},{"$f":"IF(M$4=0,\"\",IF(Liste!M85=\"\",\"\",M$4/Liste!M$5*Liste!M85))","v":""},{"$f":"IF(N$4=0,\"\",IF(Liste!N85=\"\",\"\",N$4/Liste!N$5*Liste!N85))","v":""},{"$f":"IF(O$4=0,\"\",IF(Liste!O85=\"\",\"\",O$4/Liste!O$5*Liste!O85))","v":""},{"$f":"IF(P$4=0,\"\",IF(Liste!P85=\"\",\"\",P$4/Liste!P$5*Liste!P85))","v":""},{"$f":"IF(Q$4=0,\"\",IF(Liste!Q85=\"\",\"\",Q$4/Liste!Q$5*Liste!Q85))","v":""}]
["",{"$f":"IF(Liste!B86=\"\",\"\",Liste!B86)","v":""},{"$f":"IF(Liste!C86=\"\",\"\",Liste!C86)","v":""},{"$f":"IF(Liste!D86=\"\",\"\",Liste!D86)","v":""},{"$f":"IF(E$4=0,\"\",IF(Liste!E86=\"\",\"\",E$4/Liste!E$5*Liste!E86))","v":""},{"$f":"IF(F$4=0,\"\",IF(Liste!F86=\"\",\"\",F$4/Liste!F$5*Liste!F86))","v":""},{"$f":"IF(G$4=0,\"\",IF(Liste!G86=\"\",\"\",G$4/Liste!G$5*Liste!G86))","v":""},{"$f":"IF(H$4=0,\"\",IF(Liste!H86=\"\",\"\",H$4/Liste!H$5*Liste!H86))","v":""},{"$f":"IF(I$4=0,\"\",IF(Liste!I86=\"\",\"\",I$4/Liste!I$5*Liste!I86))","v":""},{"$f":"IF(J$4=0,\"\",IF(Liste!J86=\"\",\"\",J$4/Liste!J$5*Liste!J86))","v":""},{"$f":"IF(K$4=0,\"\",IF(Liste!K86=\"\",\"\",K$4/Liste!K$5*Liste!K86))","v":""},{"$f":"IF(L$4=0,\"\",IF(Liste!L86=\"\",\"\",L$4/Liste!L$5*Liste!L86))","v":""},{"$f":"IF(M$4=0,\"\",IF(Liste!M86=\"\",\"\",M$4/Liste!M$5*Liste!M86))","v":""},{"$f":"IF(N$4=0,\"\",IF(Liste!N86=\"\",\"\",N$4/Liste!N$5*Liste!N86))","v":""},{"$f":"IF(O$4=0,\"\",IF(Liste!O86=\"\",\"\",O$4/Liste!O$5*Liste!O86))","v":""},{"$f":"IF(P$4=0,\"\",IF(Liste!P86=\"\",\"\",P$4/Liste!P$5*Liste!P86))","v":""},{"$f":"IF(Q$4=0,\"\",IF(Liste!Q86=\"\",\"\",Q$4/Liste!Q$5*Liste!Q86))","v":""}]
["",{"$f":"IF(Liste!B87=\"\",\"\",Liste!B87)","v":""},{"$f":"IF(Liste!C87=\"\",\"\",Liste!C87)","v":""},{"$f":"IF(Liste!D87=\"\",\"\",Liste!D87)","v":""},{"$f":"IF(E$4=0,\"\",IF(Liste!E87=\"\",\"\",E$4/Liste!E$5*Liste!E87))","v":""},{"$f":"IF(F$4=0,\"\",IF(Liste!F87=\"\",\"\",F$4/Liste!F$5*Liste!F87))","v":""},{"$f":"IF(G$4=0,\"\",IF(Liste!G87=\"\",\"\",G$4/Liste!G$5*Liste!G87))","v":""},{"$f":"IF(H$4=0,\"\",IF(Liste!H87=\"\",\"\",H$4/Liste!H$5*Liste!H87))","v":""},{"$f":"IF(I$4=0,\"\",IF(Liste!I87=\"\",\"\",I$4/Liste!I$5*Liste!I87))","v":""},{"$f":"IF(J$4=0,\"\",IF(Liste!J87=\"\",\"\",J$4/Liste!J$5*Liste!J87))","v":""},{"$f":"IF(K$4=0,\"\",IF(Liste!K87=\"\",\"\",K$4/Liste!K$5*Liste!K87))","v":""},{"$f":"IF(L$4=0,\"\",IF(Liste!L87=\"\",\"\",L$4/Liste!L$5*Liste!L87))","v":""},{"$f":"IF(M$4=0,\"\",IF(Liste!M87=\"\",\"\",M$4/Liste!M$5*Liste!M87))","v":""},{"$f":"IF(N$4=0,\"\",IF(Liste!N87=\"\",\"\",N$4/Liste!N$5*Liste!N87))","v":""},{"$f":"IF(O$4=0,\"\",IF(Liste!O87=\"\",\"\",O$4/Liste!O$5*Liste!O87))","v":""},{"$f":"IF(P$4=0,\"\",IF(Liste!P87=\"\",\"\",P$4/Liste!P$5*Liste!P87))","v":""},{"$f":"IF(Q$4=0,\"\",IF(Liste!Q87=\"\",\"\",Q$4/Liste!Q$5*Liste!Q87))","v":""}]
["",{"$f":"IF(Liste!B88=\"\",\"\",Liste!B88)","v":""},{"$f":"IF(Liste!C88=\"\",\"\",Liste!C88)","v":""},{"$f":"IF(Liste!D88=\"\",\"\",Liste!D88)","v":""},{"$f":"IF(E$4=0,\"\",IF(Liste!E88=\"\",\"\",E$4/Liste!E$5*Liste!E88))","v":""},{"$f":"IF(F$4=0,\"\",IF(Liste!F88=\"\",\"\",F$4/Liste!F$5*Liste!F88))","v":""},{"$f":"IF(G$4=0,\"\",IF(Liste!G88=\"\",\"\",G$4/Liste!G$5*Liste!G88))","v":""},{"$f":"IF(H$4=0,\"\",IF(Liste!H88=\"\",\"\",H$4/Liste!H$5*Liste!H88))","v":""},{"$f":"IF(I$4=0,\"\",IF(Liste!I88=\"\",\"\",I$4/Liste!I$5*Liste!I88))","v":""},{"$f":"IF(J$4=0,\"\",IF(Liste!J88=\"\",\"\",J$4/Liste!J$5*Liste!J88))","v":""},{"$f":"IF(K$4=0,\"\",IF(Liste!K88=\"\",\"\",K$4/Liste!K$5*Liste!K88))","v":""},{"$f":"IF(L$4=0,\"\",IF(Liste!L88=\"\",\"\",L$4/Liste!L$5*Liste!L88))","v":""},{"$f":"IF(M$4=0,\"\",IF(Liste!M88=\"\",\"\",M$4/Liste!M$5*Liste!M88))","v":""},{"$f":"IF(N$4=0,\"\",IF(Liste!N88=\"\",\"\",N$4/Liste!N$5*Liste!N88))","v":""},{"$f":"IF(O$4=0,\"\",IF(Liste!O88=\"\",\"\",O$4/Liste!O$5*Liste!O88))","v":""},{"$f":"IF(P$4=0,\"\",IF(Liste!P88=\"\",\"\",P$4/Liste!P$5*Liste!P88))","v":""},{"$f":"IF(Q$4=0,\"\",IF(Liste!Q88=\"\",\"\",Q$4/Liste!Q$5*Liste!Q88))","v":""}]
["",{"$f":"IF(Liste!B89=\"\",\"\",Liste!B89)","v":""},{"$f":"IF(Liste!C89=\"\",\"\",Liste!C89)","v":""},{"$f":"IF(Liste!D89=\"\",\"\",Liste!D89)","v":""},{"$f":"IF(E$4=0,\"\",IF(Liste!E89=\"\",\"\",E$4/Liste!E$5*Liste!E89))","v":""},{"$f":"IF(F$4=0,\"\",IF(Liste!F89=\"\",\"\",F$4/Liste!F$5*Liste!F89))","v":""},{"$f":"IF(G$4=0,\"\",IF(Liste!G89=\"\",\"\",G$4/Liste!G$5*Liste!G89))","v":""},{"$f":"IF(H$4=0,\"\",IF(Liste!H89=\"\",\"\",H$4/Liste!H$5*Liste!H89))","v":""},{"$f":"IF(I$4=0,\"\",IF(Liste!I89=\"\",\"\",I$4/Liste!I$5*Liste!I89))","v":""},{"$f":"IF(J$4=0,\"\",IF(Liste!J89=\"\",\"\",J$4/Liste!J$5*Liste!J89))","v":""},{"$f":"IF(K$4=0,\"\",IF(Liste!K89=\"\",\"\",K$4/Liste!K$5*Liste!K89))","v":""},{"$f":"IF(L$4=0,\"\",IF(Liste!L89=\"\",\"\",L$4/Liste!L$5*Liste!L89))","v":""},{"$f":"IF(M$4=0,\"\",IF(Liste!M89=\"\",\"\",M$4/Liste!M$5*Liste!M89))","v":""},{"$f":"IF(N$4=0,\"\",IF(Liste!N89=\"\",\"\",N$4/Liste!N$5*Liste!N89))","v":""},{"$f":"IF(O$4=0,\"\",IF(Liste!O89=\"\",\"\",O$4/Liste!O$5*Liste!O89))","v":""},{"$f":"IF(P$4=0,\"\",IF(Liste!P89=\"\",\"\",P$4/Liste!P$5*Liste!P89))","v":""},{"$f":"IF(Q$4=0,\"\",IF(Liste!Q89=\"\",\"\",Q$4/Liste!Q$5*Liste!Q89))","v":""}]
["",{"$f":"IF(Liste!B90=\"\",\"\",Liste!B90)","v":""},{"$f":"IF(Liste!C90=\"\",\"\",Liste!C90)","v":""},{"$f":"IF(Liste!D90=\"\",\"\",Liste!D90)","v":""},{"$f":"IF(E$4=0,\"\",IF(Liste!E90=\"\",\"\",E$4/Liste!E$5*Liste!E90))","v":""},{"$f":"IF(F$4=0,\"\",IF(Liste!F90=\"\",\"\",F$4/Liste!F$5*Liste!F90))","v":""},{"$f":"IF(G$4=0,\"\",IF(Liste!G90=\"\",\"\",G$4/Liste!G$5*Liste!G90))","v":""},{"$f":"IF(H$4=0,\"\",IF(Liste!H90=\"\",\"\",H$4/Liste!H$5*Liste!H90))","v":""},{"$f":"IF(I$4=0,\"\",IF(Liste!I90=\"\",\"\",I$4/Liste!I$5*Liste!I90))","v":""},{"$f":"IF(J$4=0,\"\",IF(Liste!J90=\"\",\"\",J$4/Liste!J$5*Liste!J90))","v":""},{"$f":"IF(K$4=0,\"\",IF(Liste!K90=\"\",\"\",K$4/Liste!K$5*Liste!K90))","v":""},{"$f":"IF(L$4=0,\"\",IF(Liste!L90=\"\",\"\",L$4/Liste!L$5*Liste!L90))","v":""},{"$f":"IF(M$4=0,\"\",IF(Liste!M90=\"\",\"\",M$4/Liste!M$5*Liste!M90))","v":""},{"$f":"IF(N$4=0,\"\",IF(Liste!N90=\"\",\"\",N$4/Liste!N$5*Liste!N90))","v":""},{"$f":"IF(O$4=0,\"\",IF(Liste!O90=\"\",\"\",O$4/Liste!O$5*Liste!O90))","v":""},{"$f":"IF(P$4=0,\"\",IF(Liste!P90=\"\",\"\",P$4/Liste!P$5*Liste!P90))","v":""},{"$f":"IF(Q$4=0,\"\",IF(Liste!Q90=\"\",\"\",Q$4/Liste!Q$5*Liste!Q90))","v":""}]
["",{"$f":"IF(Liste!B91=\"\",\"\",Liste!B91)","v":""},{"$f":"IF(Liste!C91=\"\",\"\",Liste!C91)","v":""},{"$f":"IF(Liste!D91=\"\",\"\",Liste!D91)","v":""},{"$f":"IF(E$4=0,\"\",IF(Liste!E91=\"\",\"\",E$4/Liste!E$5*Liste!E91))","v":""},{"$f":"IF(F$4=0,\"\",IF(Liste!F91=\"\",\"\",F$4/Liste!F$5*Liste!F91))","v":""},{"$f":"IF(G$4=0,\"\",IF(Liste!G91=\"\",\"\",G$4/Liste!G$5*Liste!G91))","v":""},{"$f":"IF(H$4=0,\"\",IF(Liste!H91=\"\",\"\",H$4/Liste!H$5*Liste!H91))","v":""},{"$f":"IF(I$4=0,\"\",IF(Liste!I91=\"\",\"\",I$4/Liste!I$5*Liste!I91))","v":""},{"$f":"IF(J$4=0,\"\",IF(Liste!J91=\"\",\"\",J$4/Liste!J$5*Liste!J91))","v":""},{"$f":"IF(K$4=0,\"\",IF(Liste!K91=\"\",\"\",K$4/Liste!K$5*Liste!K91))","v":""},{"$f":"IF(L$4=0,\"\",IF(Liste!L91=\"\",\"\",L$4/Liste!L$5*Liste!L91))","v":""},{"$f":"IF(M$4=0,\"\",IF(Liste!M91=\"\",\"\",M$4/Liste!M$5*Liste!M91))","v":""},{"$f":"IF(N$4=0,\"\",IF(Liste!N91=\"\",\"\",N$4/Liste!N$5*Liste!N91))","v":""},{"$f":"IF(O$4=0,\"\",IF(Liste!O91=\"\",\"\",O$4/Liste!O$5*Liste!O91))","v":""},{"$f":"IF(P$4=0,\"\",IF(Liste!P91=\"\",\"\",P$4/Liste!P$5*Liste!P91))","v":""},{"$f":"IF(Q$4=0,\"\",IF(Liste!Q91=\"\",\"\",Q$4/Liste!Q$5*Liste!Q91))","v":""}]
["",{"$f":"IF(Liste!B92=\"\",\"\",Liste!B92)","v":""},{"$f":"IF(Liste!C92=\"\",\"\",Liste!C92)","v":""},{"$f":"IF(Liste!D92=\"\",\"\",Liste!D92)","v":""},{"$f":"IF(E$4=0,\"\",IF(Liste!E92=\"\",\"\",E$4/Liste!E$5*Liste!E92))","v":""},{"$f":"IF(F$4=0,\"\",IF(Liste!F92=\"\",\"\",F$4/Liste!F$5*Liste!F92))","v":""},{"$f":"IF(G$4=0,\"\",IF(Liste!G92=\"\",\"\",G$4/Liste!G$5*Liste!G92))","v":""},{"$f":"IF(H$4=0,\"\",IF(Liste!H92=\"\",\"\",H$4/Liste!H$5*Liste!H92))","v":""},{"$f":"IF(I$4=0,\"\",IF(Liste!I92=\"\",\"\",I$4/Liste!I$5*Liste!I92))","v":""},{"$f":"IF(J$4=0,\"\",IF(Liste!J92=\"\",\"\",J$4/Liste!J$5*Liste!J92))","v":""},{"$f":"IF(K$4=0,\"\",IF(Liste!K92=\"\",\"\",K$4/Liste!K$5*Liste!K92))","v":""},{"$f":"IF(L$4=0,\"\",IF(Liste!L92=\"\",\"\",L$4/Liste!L$5*Liste!L92))","v":""},{"$f":"IF(M$4=0,\"\",IF(Liste!M92=\"\",\"\",M$4/Liste!M$5*Liste!M92))","v":""},{"$f":"IF(N$4=0,\"\",IF(Liste!N92=\"\",\"\",N$4/Liste!N$5*Liste!N92))","v":""},{"$f":"IF(O$4=0,\"\",IF(Liste!O92=\"\",\"\",O$4/Liste!O$5*Liste!O92))","v":""},{"$f":"IF(P$4=0,\"\",IF(Liste!P92=\"\",\"\",P$4/Liste!P$5*Liste!P92))","v":""},{"$f":"IF(Q$4=0,\"\",IF(Liste!Q92=\"\",\"\",Q$4/Liste!Q$5*Liste!Q92))","v":""}]
["",{"$f":"IF(Liste!B93=\"\",\"\",Liste!B93)","v":""},{"$f":"IF(Liste!C93=\"\",\"\",Liste!C93)","v":""},{"$f":"IF(Liste!D93=\"\",\"\",Liste!D93)","v":""},{"$f":"IF(E$4=0,\"\",IF(Liste!E93=\"\",\"\",E$4/Liste!E$5*Liste!E93))","v":""},{"$f":"IF(F$4=0,\"\",IF(Liste!F93=\"\",\"\",F$4/Liste!F$5*Liste!F93))","v":""},{"$f":"IF(G$4=0,\"\",IF(Liste!G93=\"\",\"\",G$4/Liste!G$5*Liste!G93))","v":""},{"$f":"IF(H$4=0,\"\",IF(Liste!H93=\"\",\"\",H$4/Liste!H$5*Liste!H93))","v":""},{"$f":"IF(I$4=0,\"\",IF(Liste!I93=\"\",\"\",I$4/Liste!I$5*Liste!I93))","v":""},{"$f":"IF(J$4=0,\"\",IF(Liste!J93=\"\",\"\",J$4/Liste!J$5*Liste!J93))","v":""},{"$f":"IF(K$4=0,\"\",IF(Liste!K93=\"\",\"\",K$4/Liste!K$5*Liste!K93))","v":""},{"$f":"IF(L$4=0,\"\",IF(Liste!L93=\"\",\"\",L$4/Liste!L$5*Liste!L93))","v":""},{"$f":"IF(M$4=0,\"\",IF(Liste!M93=\"\",\"\",M$4/Liste!M$5*Liste!M93))","v":""},{"$f":"IF(N$4=0,\"\",IF(Liste!N93=\"\",\"\",N$4/Liste!N$5*Liste!N93))","v":""},{"$f":"IF(O$4=0,\"\",IF(Liste!O93=\"\",\"\",O$4/Liste!O$5*Liste!O93))","v":""},{"$f":"IF(P$4=0,\"\",IF(Liste!P93=\"\",\"\",P$4/Liste!P$5*Liste!P93))","v":""},{"$f":"IF(Q$4=0,\"\",IF(Liste!Q93=\"\",\"\",Q$4/Liste!Q$5*Liste!Q93))","v":""}]
["",{"$f":"IF(Liste!B94=\"\",\"\",Liste!B94)","v":""},{"$f":"IF(Liste!C94=\"\",\"\",Liste!C94)","v":""},{"$f":"IF(Liste!D94=\"\",\"\",Liste!D94)","v":""},{"$f":"IF(E$4=0,\"\",IF(Liste!E94=\"\",\"\",E$4/Liste!E$5*Liste!E94))","v":""},{"$f":"IF(F$4=0,\"\",IF(Liste!F94=\"\",\"\",F$4/Liste!F$5*Liste!F94))","v":""},{"$f":"IF(G$4=0,\"\",IF(Liste!G94=\"\",\"\",G$4/Liste!G$5*Liste!G94))","v":""},{"$f":"IF(H$4=0,\"\",IF(Liste!H94=\"\",\"\",H$4/Liste!H$5*Liste!H94))","v":""},{"$f":"IF(I$4=0,\"\",IF(Liste!I94=\"\",\"\",I$4/Liste!I$5*Liste!I94))","v":""},{"$f":"IF(J$4=0,\"\",IF(Liste!J94=\"\",\"\",J$4/Liste!J$5*Liste!J94))","v":""},{"$f":"IF(K$4=0,\"\",IF(Liste!K94=\"\",\"\",K$4/Liste!K$5*Liste!K94))","v":""},{"$f":"IF(L$4=0,\"\",IF(Liste!L94=\"\",\"\",L$4/Liste!L$5*Liste!L94))","v":""},{"$f":"IF(M$4=0,\"\",IF(Liste!M94=\"\",\"\",M$4/Liste!M$5*Liste!M94))","v":""},{"$f":"IF(N$4=0,\"\",IF(Liste!N94=\"\",\"\",N$4/Liste!N$5*Liste!N94))","v":""},{"$f":"IF(O$4=0,\"\",IF(Liste!O94=\"\",\"\",O$4/Liste!O$5*Liste!O94))","v":""},{"$f":"IF(P$4=0,\"\",IF(Liste!P94=\"\",\"\",P$4/Liste!P$5*Liste!P94))","v":""},{"$f":"IF(Q$4=0,\"\",IF(Liste!Q94=\"\",\"\",Q$4/Liste!Q$5*Liste!Q94))","v":""}]
["",{"$f":"IF(Liste!B95=\"\",\"\",Liste!B95)","v":""},{"$f":"IF(Liste!C95=\"\",\"\",Liste!C95)","v":""},{"$f":"IF(Liste!D95=\"\",\"\",Liste!D95)","v":""},{"$f":"IF(E$4=0,\"\",IF(Liste!E95=\"\",\"\",E$4/Liste!E$5*Liste!E95))","v":""},{"$f":"IF(F$4=0,\"\",IF(Liste!F95=\"\",\"\",F$4/Liste!F$5*Liste!F95))","v":""},{"$f":"IF(G$4=0,\"\",IF(Liste!G95=\"\",\"\",G$4/Liste!G$5*Liste!G95))","v":""},{"$f":"IF(H$4=0,\"\",IF(Liste!H95=\"\",\"\",H$4/Liste!H$5*Liste!H95))","v":""},{"$f":"IF(I$4=0,\"\",IF(Liste!I95=\"\",\"\",I$4/Liste!I$5*Liste!I95))","v":""},{"$f":"IF(J$4=0,\"\",IF(Liste!J95=\"\",\"\",J$4/Liste!J$5*Liste!J95))","v":""},{"$f":"IF(K$4=0,\"\",IF(Liste!K95=\"\",\"\",K$4/Liste!K$5*Liste!K95))","v":""},{"$f":"IF(L$4=0,\"\",IF(Liste!L95=\"\",\"\",L$4/Liste!L$5*Liste!L95))","v":""},{"$f":"IF(M$4=0,\"\",IF(Liste!M95=\"\",\"\",M$4/Liste!M$5*Liste!M95))","v":""},{"$f":"IF(N$4=0,\"\",IF(Liste!N95=\"\",\"\",N$4/Liste!N$5*Liste!N95))","v":""},{"$f":"IF(O$4=0,\"\",IF(Liste!O95=\"\",\"\",O$4/Liste!O$5*Liste!O95))","v":""},{"$f":"IF(P$4=0,\"\",IF(Liste!P95=\"\",\"\",P$4/Liste!P$5*Liste!P95))","v":""},{"$f":"IF(Q$4=0,\"\",IF(Liste!Q95=\"\",\"\",Q$4/Liste!Q$5*Liste!Q95))","v":""}]
["",{"$f":"IF(Liste!B96=\"\",\"\",Liste!B96)","v":""},{"$f":"IF(Liste!C96=\"\",\"\",Liste!C96)","v":""},{"$f":"IF(Liste!D96=\"\",\"\",Liste!D96)","v":""},{"$f":"IF(E$4=0,\"\",IF(Liste!E96=\"\",\"\",E$4/Liste!E$5*Liste!E96))","v":""},{"$f":"IF(F$4=0,\"\",IF(Liste!F96=\"\",\"\",F$4/Liste!F$5*Liste!F96))","v":""},{"$f":"IF(G$4=0,\"\",IF(Liste!G96=\"\",\"\",G$4/Liste!G$5*Liste!G96))","v":""},{"$f":"IF(H$4=0,\"\",IF(Liste!H96=\"\",\"\",H$4/Liste!H$5*Liste!H96))","v":""},{"$f":"IF(I$4=0,\"\",IF(Liste!I96=\"\",\"\",I$4/Liste!I$5*Liste!I96))","v":""},{"$f":"IF(J$4=0,\"\",IF(Liste!J96=\"\",\"\",J$4/Liste!J$5*Liste!J96))","v":""},{"$f":"IF(K$4=0,\"\",IF(Liste!K96=\"\",\"\",K$4/Liste!K$5*Liste!K96))","v":""},{"$f":"IF(L$4=0,\"\",IF(Liste!L96=\"\",\"\",L$4/Liste!L$5*Liste!L96))","v":""},{"$f":"IF(M$4=0,\"\",IF(Liste!M96=\"\",\"\",M$4/Liste!M$5*Liste!M96))","v":""},{"$f":"IF(N$4=0,\"\",IF(Liste!N96=\"\",\"\",N$4/Liste!N$5*Liste!N96))","v":""},{"$f":"IF(O$4=0,\"\",IF(Liste!O96=\"\",\"\",O$4/Liste!O$5*Liste!O96))","v":""},{"$f":"IF(P$4=0,\"\",IF(Liste!P96=\"\",\"\",P$4/Liste!P$5*Liste!P96))","v":""},{"$f":"IF(Q$4=0,\"\",IF(Liste!Q96=\"\",\"\",Q$4/Liste!Q$5*Liste!Q96))","v":""}]
["",{"$f":"IF(Liste!B97=\"\",\"\",Liste!B97)","v":""},{"$f":"IF(Liste!C97=\"\",\"\",Liste!C97)","v":""},{"$f":"IF(Liste!D97=\"\",\"\",Liste!D97)","v":""},{"$f":"IF(E$4=0,\"\",IF(Liste!E97=\"\",\"\",E$4/Liste!E$5*Liste!E97))","v":""},{"$f":"IF(F$4=0,\"\",IF(Liste!F97=\"\",\"\",F$4/Liste!F$5*Liste!F97))","v":""},{"$f":"IF(G$4=0,\"\",IF(Liste!G97=\"\",\"\",G$4/Liste!G$5*Liste!G97))","v":""},{"$f":"IF(H$4=0,\"\",IF(Liste!H97=\"\",\"\",H$4/Liste!H$5*Liste!H97))","v":""},{"$f":"IF(I$4=0,\"\",IF(Liste!I97=\"\",\"\",I$4/Liste!I$5*Liste!I97))","v":""},{"$f":"IF(J$4=0,\"\",IF(Liste!J97=\"\",\"\",J$4/Liste!J$5*Liste!J97))","v":""},{"$f":"IF(K$4=0,\"\",IF(Liste!K97=\"\",\"\",K$4/Liste!K$5*Liste!K97))","v":""},{"$f":"IF(L$4=0,\"\",IF(Liste!L97=\"\",\"\",L$4/Liste!L$5*Liste!L97))","v":""},{"$f":"IF(M$4=0,\"\",IF(Liste!M97=\"\",\"\",M$4/Liste!M$5*Liste!M97))","v":""},{"$f":"IF(N$4=0,\"\",IF(Liste!N97=\"\",\"\",N$4/Liste!N$5*Liste!N97))","v":""},{"$f":"IF(O$4=0,\"\",IF(Liste!O97=\"\",\"\",O$4/Liste!O$5*Liste!O97))","v":""},{"$f":"IF(P$4=0,\"\",IF(Liste!P97=\"\",\"\",P$4/Liste!P$5*Liste!P97))","v":""},{"$f":"IF(Q$4=0,\"\",IF(Liste!Q97=\"\",\"\",Q$4/Liste!Q$5*Liste!Q97))","v":""}]
["",{"$f":"IF(Liste!B98=\"\",\"\",Liste!B98)","v":""},{"$f":"IF(Liste!C98=\"\",\"\",Liste!C98)","v":""},{"$f":"IF(Liste!D98=\"\",\"\",Liste!D98)","v":""},{"$f":"IF(E$4=0,\"\",IF(Liste!E98=\"\",\"\",E$4/Liste!E$5*Liste!E98))","v":""},{"$f":"IF(F$4=0,\"\",IF(Liste!F98=\"\",\"\",F$4/Liste!F$5*Liste!F98))","v":""},{"$f":"IF(G$4=0,\"\",IF(Liste!G98=\"\",\"\",G$4/Liste!G$5*Liste!G98))","v":""},{"$f":"IF(H$4=0,\"\",IF(Liste!H98=\"\",\"\",H$4/Liste!H$5*Liste!H98))","v":""},{"$f":"IF(I$4=0,\"\",IF(Liste!I98=\"\",\"\",I$4/Liste!I$5*Liste!I98))","v":""},{"$f":"IF(J$4=0,\"\",IF(Liste!J98=\"\",\"\",J$4/Liste!J$5*Liste!J98))","v":""},{"$f":"IF(K$4=0,\"\",IF(Liste!K98=\"\",\"\",K$4/Liste!K$5*Liste!K98))","v":""},{"$f":"IF(L$4=0,\"\",IF(Liste!L98=\"\",\"\",L$4/Liste!L$5*Liste!L98))","v":""},{"$f":"IF(M$4=0,\"\",IF(Liste!M98=\"\",\"\",M$4/Liste!M$5*Liste!M98))","v":""},{"$f":"IF(N$4=0,\"\",IF(Liste!N98=\"\",\"\",N$4/Liste!N$5*Liste!N98))","v":""},{"$f":"IF(O$4=0,\"\",IF(Liste!O98=\"\",\"\",O$4/Liste!O$5*Liste!O98))","v":""},{"$f":"IF(P$4=0,\"\",IF(Liste!P98=\"\",\"\",P$4/Liste!P$5*Liste!P98))","v":""},{"$f":"IF(Q$4=0,\"\",IF(Liste!Q98=\"\",\"\",Q$4/Liste!Q$5*Liste!Q98))","v":""}]
["",{"$f":"IF(Liste!B99=\"\",\"\",Liste!B99)","v":""},{"$f":"IF(Liste!C99=\"\",\"\",Liste!C99)","v":""},{"$f":"IF(Liste!D99=\"\",\"\",Liste!D99)","v":""},{"$f":"IF(E$4=0,\"\",IF(Liste!E99=\"\",\"\",E$4/Liste!E$5*Liste!E99))","v":""},{"$f":"IF(F$4=0,\"\",IF(Liste!F99=\"\",\"\",F$4/Liste!F$5*Liste!F99))","v":""},{"$f":"IF(G$4=0,\"\",IF(Liste!G99=\"\",\"\",G$4/Liste!G$5*Liste!G99))","v":""},{"$f":"IF(H$4=0,\"\",IF(Liste!H99=\"\",\"\",H$4/Liste!H$5*Liste!H99))","v":""},{"$f":"IF(I$4=0,\"\",IF(Liste!I99=\"\",\"\",I$4/Liste!I$5*Liste!I99))","v":""},{"$f":"IF(J$4=0,\"\",IF(Liste!J99=\"\",\"\",J$4/Liste!J$5*Liste!J99))","v":""},{"$f":"IF(K$4=0,\"\",IF(Liste!K99=\"\",\"\",K$4/Liste!K$5*Liste!K99))","v":""},{"$f":"IF(L$4=0,\"\",IF(Liste!L99=\"\",\"\",L$4/Liste!L$5*Liste!L99))","v":""},{"$f":"IF(M$4=0,\"\",IF(Liste!M99=\"\",\"\",M$4/Liste!M$5*Liste!M99))","v":""},{"$f":"IF(N$4=0,\"\",IF(Liste!N99=\"\",\"\",N$4/Liste!N$5*Liste!N99))","v":""},{"$f":"IF(O$4=0,\"\",IF(Liste!O99=\"\",\"\",O$4/Liste!O$5*Liste!O99))","v":""},{"$f":"IF(P$4=0,\"\",IF(Liste!P99=\"\",\"\",P$4/Liste!P$5*Liste!P99))","v":""},{"$f":"IF(Q$4=0,\"\",IF(Liste!Q99=\"\",\"\",Q$4/Liste!Q$5*Liste!Q99))","v":""}]
["",{"$f":"IF(Liste!B100=\"\",\"\",Liste!B100)","v":""},{"$f":"IF(Liste!C100=\"\",\"\",Liste!C100)","v":""},{"$f":"IF(Liste!D100=\"\",\"\",Liste!D100)","v":""},{"$f":"IF(E$4=0,\"\",IF(Liste!E100=\"\",\"\",E$4/Liste!E$5*Liste!E100))","v":""},{"$f":"IF(F$4=0,\"\",IF(Liste!F100=\"\",\"\",F$4/Liste!F$5*Liste!F100))","v":""},{"$f":"IF(G$4=0,\"\",IF(Liste!G100=\"\",\"\",G$4/Liste!G$5*Liste!G100))","v":""},{"$f":"IF(H$4=0,\"\",IF(Liste!H100=\"\",\"\",H$4/Liste!H$5*Liste!H100))","v":""},{"$f":"IF(I$4=0,\"\",IF(Liste!I100=\"\",\"\",I$4/Liste!I$5*Liste!I100))","v":""},{"$f":"IF(J$4=0,\"\",IF(Liste!J100=\"\",\"\",J$4/Liste!J$5*Liste!J100))","v":""},{"$f":"IF(K$4=0,\"\",IF(Liste!K100=\"\",\"\",K$4/Liste!K$5*Liste!K100))","v":""},{"$f":"IF(L$4=0,\"\",IF(Liste!L100=\"\",\"\",L$4/Liste!L$5*Liste!L100))","v":""},{"$f":"IF(M$4=0,\"\",IF(Liste!M100=\"\",\"\",M$4/Liste!M$5*Liste!M100))","v":""},{"$f":"IF(N$4=0,\"\",IF(Liste!N100=\"\",\"\",N$4/Liste!N$5*Liste!N100))","v":""},{"$f":"IF(O$4=0,\"\",IF(Liste!O100=\"\",\"\",O$4/Liste!O$5*Liste!O100))","v":""},{"$f":"IF(P$4=0,\"\",IF(Liste!P100=\"\",\"\",P$4/Liste!P$5*Liste!P100))","v":""},{"$f":"IF(Q$4=0,\"\",IF(Liste!Q100=\"\",\"\",Q$4/Liste!Q$5*Liste!Q100))","v":""}]
["",{"$f":"IF(Liste!B101=\"\",\"\",Liste!B101)","v":""},{"$f":"IF(Liste!C101=\"\",\"\",Liste!C101)","v":""},{"$f":"IF(Liste!D101=\"\",\"\",Liste!D101)","v":""},{"$f":"IF(E$4=0,\"\",IF(Liste!E101=\"\",\"\",E$4/Liste!E$5*Liste!E101))","v":""},{"$f":"IF(F$4=0,\"\",IF(Liste!F101=\"\",\"\",F$4/Liste!F$5*Liste!F101))","v":""},{"$f":"IF(G$4=0,\"\",IF(Liste!G101=\"\",\"\",G$4/Liste!G$5*Liste!G101))","v":""},{"$f":"IF(H$4=0,\"\",IF(Liste!H101=\"\",\"\",H$4/Liste!H$5*Liste!H101))","v":""},{"$f":"IF(I$4=0,\"\",IF(Liste!I101=\"\",\"\",I$4/Liste!I$5*Liste!I101))","v":""},{"$f":"IF(J$4=0,\"\",IF(Liste!J101=\"\",\"\",J$4/Liste!J$5*Liste!J101))","v":""},{"$f":"IF(K$4=0,\"\",IF(Liste!K101=\"\",\"\",K$4/Liste!K$5*Liste!K101))","v":""},{"$f":"IF(L$4=0,\"\",IF(Liste!L101=\"\",\"\",L$4/Liste!L$5*Liste!L101))","v":""},{"$f":"IF(M$4=0,\"\",IF(Liste!M101=\"\",\"\",M$4/Liste!M$5*Liste!M101))","v":""},{"$f":"IF(N$4=0,\"\",IF(Liste!N101=\"\",\"\",N$4/Liste!N$5*Liste!N101))","v":""},{"$f":"IF(O$4=0,\"\",IF(Liste!O101=\"\",\"\",O$4/Liste!O$5*Liste!O101))","v":""},{"$f":"IF(P$4=0,\"\",IF(Liste!P101=\"\",\"\",P$4/Liste!P$5*Liste!P101))","v":""},{"$f":"IF(Q$4=0,\"\",IF(Liste!Q101=\"\",\"\",Q$4/Liste!Q$5*Liste!Q101))","v":""}]
["",{"$f":"IF(Liste!B102=\"\",\"\",Liste!B102)","v":""},{"$f":"IF(Liste!C102=\"\",\"\",Liste!C102)","v":""},{"$f":"IF(Liste!D102=\"\",\"\",Liste!D102)","v":""},{"$f":"IF(E$4=0,\"\",IF(Liste!E102=\"\",\"\",E$4/Liste!E$5*Liste!E102))","v":""},{"$f":"IF(F$4=0,\"\",IF(Liste!F102=\"\",\"\",F$4/Liste!F$5*Liste!F102))","v":""},{"$f":"IF(G$4=0,\"\",IF(Liste!G102=\"\",\"\",G$4/Liste!G$5*Liste!G102))","v":""},{"$f":"IF(H$4=0,\"\",IF(Liste!H102=\"\",\"\",H$4/Liste!H$5*Liste!H102))","v":""},{"$f":"IF(I$4=0,\"\",IF(Liste!I102=\"\",\"\",I$4/Liste!I$5*Liste!I102))","v":""},{"$f":"IF(J$4=0,\"\",IF(Liste!J102=\"\",\"\",J$4/Liste!J$5*Liste!J102))","v":""},{"$f":"IF(K$4=0,\"\",IF(Liste!K102=\"\",\"\",K$4/Liste!K$5*Liste!K102))","v":""},{"$f":"IF(L$4=0,\"\",IF(Liste!L102=\"\",\"\",L$4/Liste!L$5*Liste!L102))","v":""},{"$f":"IF(M$4=0,\"\",IF(Liste!M102=\"\",\"\",M$4/Liste!M$5*Liste!M102))","v":""},{"$f":"IF(N$4=0,\"\",IF(Liste!N102=\"\",\"\",N$4/Liste!N$5*Liste!N102))","v":""},{"$f":"IF(O$4=0,\"\",IF(Liste!O102=\"\",\"\",O$4/Liste!O$5*Liste!O102))","v":""},{"$f":"IF(P$4=0,\"\",IF(Liste!P102=\"\",\"\",P$4/Liste!P$5*Liste!P102))","v":""},{"$f":"IF(Q$4=0,\"\",IF(Liste!Q102=\"\",\"\",Q$4/Liste!Q$5*Liste!Q102))","v":""}]
["",{"$f":"IF(Liste!B103=\"\",\"\",Liste!B103)","v":""},{"$f":"IF(Liste!C103=\"\",\"\",Liste!C103)","v":""},{"$f":"IF(Liste!D103=\"\",\"\",Liste!D103)","v":""},{"$f":"IF(E$4=0,\"\",IF(Liste!E103=\"\",\"\",E$4/Liste!E$5*Liste!E103))","v":""},{"$f":"IF(F$4=0,\"\",IF(Liste!F103=\"\",\"\",F$4/Liste!F$5*Liste!F103))","v":""},{"$f":"IF(G$4=0,\"\",IF(Liste!G103=\"\",\"\",G$4/Liste!G$5*Liste!G103))","v":""},{"$f":"IF(H$4=0,\"\",IF(Liste!H103=\"\",\"\",H$4/Liste!H$5*Liste!H103))","v":""},{"$f":"IF(I$4=0,\"\",IF(Liste!I103=\"\",\"\",I$4/Liste!I$5*Liste!I103))","v":""},{"$f":"IF(J$4=0,\"\",IF(Liste!J103=\"\",\"\",J$4/Liste!J$5*Liste!J103))","v":""},{"$f":"IF(K$4=0,\"\",IF(Liste!K103=\"\",\"\",K$4/Liste!K$5*Liste!K103))","v":""},{"$f":"IF(L$4=0,\"\",IF(Liste!L103=\"\",\"\",L$4/Liste!L$5*Liste!L103))","v":""},{"$f":"IF(M$4=0,\"\",IF(Liste!M103=\"\",\"\",M$4/Liste!M$5*Liste!M103))","v":""},{"$f":"IF(N$4=0,\"\",IF(Liste!N103=\"\",\"\",N$4/Liste!N$5*Liste!N103))","v":""},{"$f":"IF(O$4=0,\"\",IF(Liste!O103=\"\",\"\",O$4/Liste!O$5*Liste!O103))","v":""},{"$f":"IF(P$4=0,\"\",IF(Liste!P103=\"\",\"\",P$4/Liste!P$5*Liste!P103))","v":""},{"$f":"IF(Q$4=0,\"\",IF(Liste!Q103=\"\",\"\",Q$4/Liste!Q$5*Liste!Q103))","v":""}]
["",{"$f":"IF(Liste!B104=\"\",\"\",Liste!B104)","v":""},{"$f":"IF(Liste!C104=\"\",\"\",Liste!C104)","v":""},{"$f":"IF(Liste!D104=\"\",\"\",Liste!D104)","v":""},{"$f":"IF(E$4=0,\"\",IF(Liste!E104=\"\",\"\",E$4/Liste!E$5*Liste!E104))","v":""},{"$f":"IF(F$4=0,\"\",IF(Liste!F104=\"\",\"\",F$4/Liste!F$5*Liste!F104))","v":""},{"$f":"IF(G$4=0,\"\",IF(Liste!G104=\"\",\"\",G$4/Liste!G$5*Liste!G104))","v":""},{"$f":"IF(H$4=0,\"\",IF(Liste!H104=\"\",\"\",H$4/Liste!H$5*Liste!H104))","v":""},{"$f":"IF(I$4=0,\"\",IF(Liste!I104=\"\",\"\",I$4/Liste!I$5*Liste!I104))","v":""},{"$f":"IF(J$4=0,\"\",IF(Liste!J104=\"\",\"\",J$4/Liste!J$5*Liste!J104))","v":""},{"$f":"IF(K$4=0,\"\",IF(Liste!K104=\"\",\"\",K$4/Liste!K$5*Liste!K104))","v":""},{"$f":"IF(L$4=0,\"\",IF(Liste!L104=\"\",\"\",L$4/Liste!L$5*Liste!L104))","v":""},{"$f":"IF(M$4=0,\"\",IF(Liste!M104=\"\",\"\",M$4/Liste!M$5*Liste!M104))","v":""},{"$f":"IF(N$4=0,\"\",IF(Liste!N104=\"\",\"\",N$4/Liste!N$5*Liste!N104))","v":""},{"$f":"IF(O$4=0,\"\",IF(Liste!O104=\"\",\"\",O$4/Liste!O$5*Liste!O104))","v":""},{"$f":"IF(P$4=0,\"\",IF(Liste!P104=\"\",\"\",P$4/Liste!P$5*Liste!P104))","v":""},{"$f":"IF(Q$4=0,\"\",IF(Liste!Q104=\"\",\"\",Q$4/Liste!Q$5*Liste!Q104))","v":""}]
["",{"$f":"IF(Liste!B105=\"\",\"\",Liste!B105)","v":""},{"$f":"IF(Liste!C105=\"\",\"\",Liste!C105)","v":""},{"$f":"IF(Liste!D105=\"\",\"\",Liste!D105)","v":""},{"$f":"IF(E$4=0,\"\",IF(Liste!E105=\"\",\"\",E$4/Liste!E$5*Liste!E105))","v":""},{"$f":"IF(F$4=0,\"\",IF(Liste!F105=\"\",\"\",F$4/Liste!F$5*Liste!F105))","v":""},{"$f":"IF(G$4=0,\"\",IF(Liste!G105=\"\",\"\",G$4/Liste!G$5*Liste!G105))","v":""},{"$f":"IF(H$4=0,\"\",IF(Liste!H105=\"\",\"\",H$4/Liste!H$5*Liste!H105))","v":""},{"$f":"IF(I$4=0,\"\",IF(Liste!I105=\"\",\"\",I$4/Liste!I$5*Liste!I105))","v":""},{"$f":"IF(J$4=0,\"\",IF(Liste!J105=\"\",\"\",J$4/Liste!J$5*Liste!J105))","v":""},{"$f":"IF(K$4=0,\"\",IF(Liste!K105=\"\",\"\",K$4/Liste!K$5*Liste!K105))","v":""},{"$f":"IF(L$4=0,\"\",IF(Liste!L105=\"\",\"\",L$4/Liste!L$5*Liste!L105))","v":""},{"$f":"IF(M$4=0,\"\",IF(Liste!M105=\"\",\"\",M$4/Liste!M$5*Liste!M105))","v":""},{"$f":"IF(N$4=0,\"\",IF(Liste!N105=\"\",\"\",N$4/Liste!N$5*Liste!N105))","v":""},{"$f":"IF(O$4=0,\"\",IF(Liste!O105=\"\",\"\",O$4/Liste!O$5*Liste!O105))","v":""},{"$f":"IF(P$4=0,\"\",IF(Liste!P105=\"\",\"\",P$4/Liste!P$5*Liste!P105))","v":""},{"$f":"IF(Q$4=0,\"\",IF(Liste!Q105=\"\",\"\",Q$4/Liste!Q$5*Liste!Q105))","v":""}]
["",{"$f":"IF(Liste!B106=\"\",\"\",Liste!B106)","v":""},{"$f":"IF(Liste!C106=\"\",\"\",Liste!C106)","v":""},{"$f":"IF(Liste!D106=\"\",\"\",Liste!D106)","v":""},{"$f":"IF(E$4=0,\"\",IF(Liste!E106=\"\",\"\",E$4/Liste!E$5*Liste!E106))","v":""},{"$f":"IF(F$4=0,\"\",IF(Liste!F106=\"\",\"\",F$4/Liste!F$5*Liste!F106))","v":""},{"$f":"IF(G$4=0,\"\",IF(Liste!G106=\"\",\"\",G$4/Liste!G$5*Liste!G106))","v":""},{"$f":"IF(H$4=0,\"\",IF(Liste!H106=\"\",\"\",H$4/Liste!H$5*Liste!H106))","v":""},{"$f":"IF(I$4=0,\"\",IF(Liste!I106=\"\",\"\",I$4/Liste!I$5*Liste!I106))","v":""},{"$f":"IF(J$4=0,\"\",IF(Liste!J106=\"\",\"\",J$4/Liste!J$5*Liste!J106))","v":""},{"$f":"IF(K$4=0,\"\",IF(Liste!K106=\"\",\"\",K$4/Liste!K$5*Liste!K106))","v":""},{"$f":"IF(L$4=0,\"\",IF(Liste!L106=\"\",\"\",L$4/Liste!L$5*Liste!L106))","v":""},{"$f":"IF(M$4=0,\"\",IF(Liste!M106=\"\",\"\",M$4/Liste!M$5*Liste!M106))","v":""},{"$f":"IF(N$4=0,\"\",IF(Liste!N106=\"\",\"\",N$4/Liste!N$5*Liste!N106))","v":""},{"$f":"IF(O$4=0,\"\",IF(Liste!O106=\"\",\"\",O$4/Liste!O$5*Liste!O106))","v":""},{"$f":"IF(P$4=0,\"\",IF(Liste!P106=\"\",\"\",P$4/Liste!P$5*Liste!P106))","v":""},{"$f":"IF(Q$4=0,\"\",IF(Liste!Q106=\"\",\"\",Q$4/Liste!Q$5*Liste!Q106))","v":""}]
["",{"$f":"IF(Liste!B107=\"\",\"\",Liste!B107)","v":""},{"$f":"IF(Liste!C107=\"\",\"\",Liste!C107)","v":""},{"$f":"IF(Liste!D107=\"\",\"\",Liste!D107)","v":""},{"$f":"IF(E$4=0,\"\",IF(Liste!E107=\"\",\"\",E$4/Liste!E$5*Liste!E107))","v":""},{"$f":"IF(F$4=0,\"\",IF(Liste!F107=\"\",\"\",F$4/Liste!F$5*Liste!F107))","v":""},{"$f":"IF(G$4=0,\"\",IF(Liste!G107=\"\",\"\",G$4/Liste!G$5*Liste!G107))","v":""},{"$f":"IF(H$4=0,\"\",IF(Liste!H107=\"\",\"\",H$4/Liste!H$5*Liste!H107))","v":""},{"$f":"IF(I$4=0,\"\",IF(Liste!I107=\"\",\"\",I$4/Liste!I$5*Liste!I107))","v":""},{"$f":"IF(J$4=0,\"\",IF(Liste!J107=\"\",\"\",J$4/Liste!J$5*Liste!J107))","v":""},{"$f":"IF(K$4=0,\"\",IF(Liste!K107=\"\",\"\",K$4/Liste!K$5*Liste!K107))","v":""},{"$f":"IF(L$4=0,\"\",IF(Liste!L107=\"\",\"\",L$4/Liste!L$5*Liste!L107))","v":""},{"$f":"IF(M$4=0,\"\",IF(Liste!M107=\"\",\"\",M$4/Liste!M$5*Liste!M107))","v":""},{"$f":"IF(N$4=0,\"\",IF(Liste!N107=\"\",\"\",N$4/Liste!N$5*Liste!N107))","v":""},{"$f":"IF(O$4=0,\"\",IF(Liste!O107=\"\",\"\",O$4/Liste!O$5*Liste!O107))","v":""},{"$f":"IF(P$4=0,\"\",IF(Liste!P107=\"\",\"\",P$4/Liste!P$5*Liste!P107))","v":""},{"$f":"IF(Q$4=0,\"\",IF(Liste!Q107=\"\",\"\",Q$4/Liste!Q$5*Liste!Q107))","v":""}]
["",{"$f":"IF(Liste!B108=\"\",\"\",Liste!B108)","v":""},{"$f":"IF(Liste!C108=\"\",\"\",Liste!C108)","v":""},{"$f":"IF(Liste!D108=\"\",\"\",Liste!D108)","v":""},{"$f":"IF(E$4=0,\"\",IF(Liste!E108=\"\",\"\",E$4/Liste!E$5*Liste!E108))","v":""},{"$f":"IF(F$4=0,\"\",IF(Liste!F108=\"\",\"\",F$4/Liste!F$5*Liste!F108))","v":""},{"$f":"IF(G$4=0,\"\",IF(Liste!G108=\"\",\"\",G$4/Liste!G$5*Liste!G108))","v":""},{"$f":"IF(H$4=0,\"\",IF(Liste!H108=\"\",\"\",H$4/Liste!H$5*Liste!H108))","v":""},{"$f":"IF(I$4=0,\"\",IF(Liste!I108=\"\",\"\",I$4/Liste!I$5*Liste!I108))","v":""},{"$f":"IF(J$4=0,\"\",IF(Liste!J108=\"\",\"\",J$4/Liste!J$5*Liste!J108))","v":""},{"$f":"IF(K$4=0,\"\",IF(Liste!K108=\"\",\"\",K$4/Liste!K$5*Liste!K108))","v":""},{"$f":"IF(L$4=0,\"\",IF(Liste!L108=\"\",\"\",L$4/Liste!L$5*Liste!L108))","v":""},{"$f":"IF(M$4=0,\"\",IF(Liste!M108=\"\",\"\",M$4/Liste!M$5*Liste!M108))","v":""},{"$f":"IF(N$4=0,\"\",IF(Liste!N108=\"\",\"\",N$4/Liste!N$5*Liste!N108))","v":""},{"$f":"IF(O$4=0,\"\",IF(Liste!O108=\"\",\"\",O$4/Liste!O$5*Liste!O108))","v":""},{"$f":"IF(P$4=0,\"\",IF(Liste!P108=\"\",\"\",P$4/Liste!P$5*Liste!P108))","v":""},{"$f":"IF(Q$4=0,\"\",IF(Liste!Q108=\"\",\"\",Q$4/Liste!Q$5*Liste!Q108))","v":""}]
["",{"$f":"IF(Liste!B109=\"\",\"\",Liste!B109)","v":""},{"$f":"IF(Liste!C109=\"\",\"\",Liste!C109)","v":""},{"$f":"IF(Liste!D109=\"\",\"\",Liste!D109)","v":""},{"$f":"IF(E$4=0,\"\",IF(Liste!E109=\"\",\"\",E$4/Liste!E$5*Liste!E109))","v":""},{"$f":"IF(F$4=0,\"\",IF(Liste!F109=\"\",\"\",F$4/Liste!F$5*Liste!F109))","v":""},{"$f":"IF(G$4=0,\"\",IF(Liste!G109=\"\",\"\",G$4/Liste!G$5*Liste!G109))","v":""},{"$f":"IF(H$4=0,\"\",IF(Liste!H109=\"\",\"\",H$4/Liste!H$5*Liste!H109))","v":""},{"$f":"IF(I$4=0,\"\",IF(Liste!I109=\"\",\"\",I$4/Liste!I$5*Liste!I109))","v":""},{"$f":"IF(J$4=0,\"\",IF(Liste!J109=\"\",\"\",J$4/Liste!J$5*Liste!J109))","v":""},{"$f":"IF(K$4=0,\"\",IF(Liste!K109=\"\",\"\",K$4/Liste!K$5*Liste!K109))","v":""},{"$f":"IF(L$4=0,\"\",IF(Liste!L109=\"\",\"\",L$4/Liste!L$5*Liste!L109))","v":""},{"$f":"IF(M$4=0,\"\",IF(Liste!M109=\"\",\"\",M$4/Liste!M$5*Liste!M109))","v":""},{"$f":"IF(N$4=0,\"\",IF(Liste!N109=\"\",\"\",N$4/Liste!N$5*Liste!N109))","v":""},{"$f":"IF(O$4=0,\"\",IF(Liste!O109=\"\",\"\",O$4/Liste!O$5*Liste!O109))","v":""},{"$f":"IF(P$4=0,\"\",IF(Liste!P109=\"\",\"\",P$4/Liste!P$5*Liste!P109))","v":""},{"$f":"IF(Q$4=0,\"\",IF(Liste!Q109=\"\",\"\",Q$4/Liste!Q$5*Liste!Q109))","v":""}]
["",{"$f":"IF(Liste!B110=\"\",\"\",Liste!B110)","v":""},{"$f":"IF(Liste!C110=\"\",\"\",Liste!C110)","v":""},{"$f":"IF(Liste!D110=\"\",\"\",Liste!D110)","v":""},{"$f":"IF(E$4=0,\"\",IF(Liste!E110=\"\",\"\",E$4/Liste!E$5*Liste!E110))","v":""},{"$f":"IF(F$4=0,\"\",IF(Liste!F110=\"\",\"\",F$4/Liste!F$5*Liste!F110))","v":""},{"$f":"IF(G$4=0,\"\",IF(Liste!G110=\"\",\"\",G$4/Liste!G$5*Liste!G110))","v":""},{"$f":"IF(H$4=0,\"\",IF(Liste!H110=\"\",\"\",H$4/Liste!H$5*Liste!H110))","v":""},{"$f":"IF(I$4=0,\"\",IF(Liste!I110=\"\",\"\",I$4/Liste!I$5*Liste!I110))","v":""},{"$f":"IF(J$4=0,\"\",IF(Liste!J110=\"\",\"\",J$4/Liste!J$5*Liste!J110))","v":""},{"$f":"IF(K$4=0,\"\",IF(Liste!K110=\"\",\"\",K$4/Liste!K$5*Liste!K110))","v":""},{"$f":"IF(L$4=0,\"\",IF(Liste!L110=\"\",\"\",L$4/Liste!L$5*Liste!L110))","v":""},{"$f":"IF(M$4=0,\"\",IF(Liste!M110=\"\",\"\",M$4/Liste!M$5*Liste!M110))","v":""},{"$f":"IF(N$4=0,\"\",IF(Liste!N110=\"\",\"\",N$4/Liste!N$5*Liste!N110))","v":""},{"$f":"IF(O$4=0,\"\",IF(Liste!O110=\"\",\"\",O$4/Liste!O$5*Liste!O110))","v":""},{"$f":"IF(P$4=0,\"\",IF(Liste!P110=\"\",\"\",P$4/Liste!P$5*Liste!P110))","v":""},{"$f":"IF(Q$4=0,\"\",IF(Liste!Q110=\"\",\"\",Q$4/Liste!Q$5*Liste!Q110))","v":""}]
["",{"$f":"IF(Liste!B111=\"\",\"\",Liste!B111)","v":""},{"$f":"IF(Liste!C111=\"\",\"\",Liste!C111)","v":""},{"$f":"IF(Liste!D111=\"\",\"\",Liste!D111)","v":""},{"$f":"IF(E$4=0,\"\",IF(Liste!E111=\"\",\"\",E$4/Liste!E$5*Liste!E111))","v":""},{"$f":"IF(F$4=0,\"\",IF(Liste!F111=\"\",\"\",F$4/Liste!F$5*Liste!F111))","v":""},{"$f":"IF(G$4=0,\"\",IF(Liste!G111=\"\",\"\",G$4/Liste!G$5*Liste!G111))","v":""},{"$f":"IF(H$4=0,\"\",IF(Liste!H111=\"\",\"\",H$4/Liste!H$5*Liste!H111))","v":""},{"$f":"IF(I$4=0,\"\",IF(Liste!I111=\"\",\"\",I$4/Liste!I$5*Liste!I111))","v":""},{"$f":"IF(J$4=0,\"\",IF(Liste!J111=\"\",\"\",J$4/Liste!J$5*Liste!J111))","v":""},{"$f":"IF(K$4=0,\"\",IF(Liste!K111=\"\",\"\",K$4/Liste!K$5*Liste!K111))","v":""},{"$f":"IF(L$4=0,\"\",IF(Liste!L111=\"\",\"\",L$4/Liste!L$5*Liste!L111))","v":""},{"$f":"IF(M$4=0,\"\",IF(Liste!M111=\"\",\"\",M$4/Liste!M$5*Liste!M111))","v":""},{"$f":"IF(N$4=0,\"\",IF(Liste!N111=\"\",\"\",N$4/Liste!N$5*Liste!N111))","v":""},{"$f":"IF(O$4=0,\"\",IF(Liste!O111=\"\",\"\",O$4/Liste!O$5*Liste!O111))","v":""},{"$f":"IF(P$4=0,\"\",IF(Liste!P111=\"\",\"\",P$4/Liste!P$5*Liste!P111))","v":""},{"$f":"IF(Q$4=0,\"\",IF(Liste!Q111=\"\",\"\",Q$4/Liste!Q$5*Liste!Q111))","v":""}]
["",{"$f":"IF(Liste!B112=\"\",\"\",Liste!B112)","v":""},{"$f":"IF(Liste!C112=\"\",\"\",Liste!C112)","v":""},{"$f":"IF(Liste!D112=\"\",\"\",Liste!D112)","v":""},{"$f":"IF(E$4=0,\"\",IF(Liste!E112=\"\",\"\",E$4/Liste!E$5*Liste!E112))","v":""},{"$f":"IF(F$4=0,\"\",IF(Liste!F112=\"\",\"\",F$4/Liste!F$5*Liste!F112))","v":""},{"$f":"IF(G$4=0,\"\",IF(Liste!G112=\"\",\"\",G$4/Liste!G$5*Liste!G112))","v":""},{"$f":"IF(H$4=0,\"\",IF(Liste!H112=\"\",\"\",H$4/Liste!H$5*Liste!H112))","v":""},{"$f":"IF(I$4=0,\"\",IF(Liste!I112=\"\",\"\",I$4/Liste!I$5*Liste!I112))","v":""},{"$f":"IF(J$4=0,\"\",IF(Liste!J112=\"\",\"\",J$4/Liste!J$5*Liste!J112))","v":""},{"$f":"IF(K$4=0,\"\",IF(Liste!K112=\"\",\"\",K$4/Liste!K$5*Liste!K112))","v":""},{"$f":"IF(L$4=0,\"\",IF(Liste!L112=\"\",\"\",L$4/Liste!L$5*Liste!L112))","v":""},{"$f":"IF(M$4=0,\"\",IF(Liste!M112=\"\",\"\",M$4/Liste!M$5*Liste!M112))","v":""},{"$f":"IF(N$4=0,\"\",IF(Liste!N112=\"\",\"\",N$4/Liste!N$5*Liste!N112))","v":""},{"$f":"IF(O$4=0,\"\",IF(Liste!O112=\"\",\"\",O$4/Liste!O$5*Liste!O112))","v":""},{"$f":"IF(P$4=0,\"\",IF(Liste!P112=\"\",\"\",P$4/Liste!P$5*Liste!P112))","v":""},{"$f":"IF(Q$4=0,\"\",IF(Liste!Q112=\"\",\"\",Q$4/Liste!Q$5*Liste!Q112))","v":""}]
["",{"$f":"IF(Liste!B113=\"\",\"\",Liste!B113)","v":""},{"$f":"IF(Liste!C113=\"\",\"\",Liste!C113)","v":""},{"$f":"IF(Liste!D113=\"\",\"\",Liste!D113)","v":""},{"$f":"IF(E$4=0,\"\",IF(Liste!E113=\"\",\"\",E$4/Liste!E$5*Liste!E113))","v":""},{"$f":"IF(F$4=0,\"\",IF(Liste!F113=\"\",\"\",F$4/Liste!F$5*Liste!F113))","v":""},{"$f":"IF(G$4=0,\"\",IF(Liste!G113=\"\",\"\",G$4/Liste!G$5*Liste!G113))","v":""},{"$f":"IF(H$4=0,\"\",IF(Liste!H113=\"\",\"\",H$4/Liste!H$5*Liste!H113))","v":""},{"$f":"IF(I$4=0,\"\",IF(Liste!I113=\"\",\"\",I$4/Liste!I$5*Liste!I113))","v":""},{"$f":"IF(J$4=0,\"\",IF(Liste!J113=\"\",\"\",J$4/Liste!J$5*Liste!J113))","v":""},{"$f":"IF(K$4=0,\"\",IF(Liste!K113=\"\",\"\",K$4/Liste!K$5*Liste!K113))","v":""},{"$f":"IF(L$4=0,\"\",IF(Liste!L113=\"\",\"\",L$4/Liste!L$5*Liste!L113))","v":""},{"$f":"IF(M$4=0,\"\",IF(Liste!M113=\"\",\"\",M$4/Liste!M$5*Liste!M113))","v":""},{"$f":"IF(N$4=0,\"\",IF(Liste!N113=\"\",\"\",N$4/Liste!N$5*Liste!N113))","v":""},{"$f":"IF(O$4=0,\"\",IF(Liste!O113=\"\",\"\",O$4/Liste!O$5*Liste!O113))","v":""},{"$f":"IF(P$4=0,\"\",IF(Liste!P113=\"\",\"\",P$4/Liste!P$5*Liste!P113))","v":""},{"$f":"IF(Q$4=0,\"\",IF(Liste!Q113=\"\",\"\",Q$4/Liste!Q$5*Liste!Q113))","v":""}]
["",{"$f":"IF(Liste!B114=\"\",\"\",Liste!B114)","v":""},{"$f":"IF(Liste!C114=\"\",\"\",Liste!C114)","v":""},{"$f":"IF(Liste!D114=\"\",\"\",Liste!D114)","v":""},{"$f":"IF(E$4=0,\"\",IF(Liste!E114=\"\",\"\",E$4/Liste!E$5*Liste!E114))","v":""},{"$f":"IF(F$4=0,\"\",IF(Liste!F114=\"\",\"\",F$4/Liste!F$5*Liste!F114))","v":""},{"$f":"IF(G$4=0,\"\",IF(Liste!G114=\"\",\"\",G$4/Liste!G$5*Liste!G114))","v":""},{"$f":"IF(H$4=0,\"\",IF(Liste!H114=\"\",\"\",H$4/Liste!H$5*Liste!H114))","v":""},{"$f":"IF(I$4=0,\"\",IF(Liste!I114=\"\",\"\",I$4/Liste!I$5*Liste!I114))","v":""},{"$f":"IF(J$4=0,\"\",IF(Liste!J114=\"\",\"\",J$4/Liste!J$5*Liste!J114))","v":""},{"$f":"IF(K$4=0,\"\",IF(Liste!K114=\"\",\"\",K$4/Liste!K$5*Liste!K114))","v":""},{"$f":"IF(L$4=0,\"\",IF(Liste!L114=\"\",\"\",L$4/Liste!L$5*Liste!L114))","v":""},{"$f":"IF(M$4=0,\"\",IF(Liste!M114=\"\",\"\",M$4/Liste!M$5*Liste!M114))","v":""},{"$f":"IF(N$4=0,\"\",IF(Liste!N114=\"\",\"\",N$4/Liste!N$5*Liste!N114))","v":""},{"$f":"IF(O$4=0,\"\",IF(Liste!O114=\"\",\"\",O$4/Liste!O$5*Liste!O114))","v":""},{"$f":"IF(P$4=0,\"\",IF(Liste!P114=\"\",\"\",P$4/Liste!P$5*Liste!P114))","v":""},{"$f":"IF(Q$4=0,\"\",IF(Liste!Q114=\"\",\"\",Q$4/Liste!Q$5*Liste!Q114))","v":""}]
["",{"$f":"IF(Liste!B115=\"\",\"\",Liste!B115)","v":""},{"$f":"IF(Liste!C115=\"\",\"\",Liste!C115)","v":""},{"$f":"IF(Liste!D115=\"\",\"\",Liste!D115)","v":""},{"$f":"IF(E$4=0,\"\",IF(Liste!E115=\"\",\"\",E$4/Liste!E$5*Liste!E115))","v":""},{"$f":"IF(F$4=0,\"\",IF(Liste!F115=\"\",\"\",F$4/Liste!F$5*Liste!F115))","v":""},{"$f":"IF(G$4=0,\"\",IF(Liste!G115=\"\",\"\",G$4/Liste!G$5*Liste!G115))","v":""},{"$f":"IF(H$4=0,\"\",IF(Liste!H115=\"\",\"\",H$4/Liste!H$5*Liste!H115))","v":""},{"$f":"IF(I$4=0,\"\",IF(Liste!I115=\"\",\"\",I$4/Liste!I$5*Liste!I115))","v":""},{"$f":"IF(J$4=0,\"\",IF(Liste!J115=\"\",\"\",J$4/Liste!J$5*Liste!J115))","v":""},{"$f":"IF(K$4=0,\"\",IF(Liste!K115=\"\",\"\",K$4/Liste!K$5*Liste!K115))","v":""},{"$f":"IF(L$4=0,\"\",IF(Liste!L115=\"\",\"\",L$4/Liste!L$5*Liste!L115))","v":""},{"$f":"IF(M$4=0,\"\",IF(Liste!M115=\"\",\"\",M$4/Liste!M$5*Liste!M115))","v":""},{"$f":"IF(N$4=0,\"\",IF(Liste!N115=\"\",\"\",N$4/Liste!N$5*Liste!N115))","v":""},{"$f":"IF(O$4=0,\"\",IF(Liste!O115=\"\",\"\",O$4/Liste!O$5*Liste!O115))","v":""},{"$f":"IF(P$4=0,\"\",IF(Liste!P115=\"\",\"\",P$4/Liste!P$5*Liste!P115))","v":""},{"$f":"IF(Q$4=0,\"\",IF(Liste!Q115=\"\",\"\",Q$4/Liste!Q$5*Liste!Q115))","v":""}]
["",{"$f":"IF(Liste!B116=\"\",\"\",Liste!B116)","v":""},{"$f":"IF(Liste!C116=\"\",\"\",Liste!C116)","v":""},{"$f":"IF(Liste!D116=\"\",\"\",Liste!D116)","v":""},{"$f":"IF(E$4=0,\"\",IF(Liste!E116=\"\",\"\",E$4/Liste!E$5*Liste!E116))","v":""},{"$f":"IF(F$4=0,\"\",IF(Liste!F116=\"\",\"\",F$4/Liste!F$5*Liste!F116))","v":""},{"$f":"IF(G$4=0,\"\",IF(Liste!G116=\"\",\"\",G$4/Liste!G$5*Liste!G116))","v":""},{"$f":"IF(H$4=0,\"\",IF(Liste!H116=\"\",\"\",H$4/Liste!H$5*Liste!H116))","v":""},{"$f":"IF(I$4=0,\"\",IF(Liste!I116=\"\",\"\",I$4/Liste!I$5*Liste!I116))","v":""},{"$f":"IF(J$4=0,\"\",IF(Liste!J116=\"\",\"\",J$4/Liste!J$5*Liste!J116))","v":""},{"$f":"IF(K$4=0,\"\",IF(Liste!K116=\"\",\"\",K$4/Liste!K$5*Liste!K116))","v":""},{"$f":"IF(L$4=0,\"\",IF(Liste!L116=\"\",\"\",L$4/Liste!L$5*Liste!L116))","v":""},{"$f":"IF(M$4=0,\"\",IF(Liste!M116=\"\",\"\",M$4/Liste!M$5*Liste!M116))","v":""},{"$f":"IF(N$4=0,\"\",IF(Liste!N116=\"\",\"\",N$4/Liste!N$5*Liste!N116))","v":""},{"$f":"IF(O$4=0,\"\",IF(Liste!O116=\"\",\"\",O$4/Liste!O$5*Liste!O116))","v":""},{"$f":"IF(P$4=0,\"\",IF(Liste!P116=\"\",\"\",P$4/Liste!P$5*Liste!P116))","v":""},{"$f":"IF(Q$4=0,\"\",IF(Liste!Q116=\"\",\"\",Q$4/Liste!Q$5*Liste!Q116))","v":""}]
["",{"$f":"IF(Liste!B117=\"\",\"\",Liste!B117)","v":""},{"$f":"IF(Liste!C117=\"\",\"\",Liste!C117)","v":""},{"$f":"IF(Liste!D117=\"\",\"\",Liste!D117)","v":""},{"$f":"IF(E$4=0,\"\",IF(Liste!E117=\"\",\"\",E$4/Liste!E$5*Liste!E117))","v":""},{"$f":"IF(F$4=0,\"\",IF(Liste!F117=\"\",\"\",F$4/Liste!F$5*Liste!F117))","v":""},{"$f":"IF(G$4=0,\"\",IF(Liste!G117=\"\",\"\",G$4/Liste!G$5*Liste!G117))","v":""},{"$f":"IF(H$4=0,\"\",IF(Liste!H117=\"\",\"\",H$4/Liste!H$5*Liste!H117))","v":""},{"$f":"IF(I$4=0,\"\",IF(Liste!I117=\"\",\"\",I$4/Liste!I$5*Liste!I117))","v":""},{"$f":"IF(J$4=0,\"\",IF(Liste!J117=\"\",\"\",J$4/Liste!J$5*Liste!J117))","v":""},{"$f":"IF(K$4=0,\"\",IF(Liste!K117=\"\",\"\",K$4/Liste!K$5*Liste!K117))","v":""},{"$f":"IF(L$4=0,\"\",IF(Liste!L117=\"\",\"\",L$4/Liste!L$5*Liste!L117))","v":""},{"$f":"IF(M$4=0,\"\",IF(Liste!M117=\"\",\"\",M$4/Liste!M$5*Liste!M117))","v":""},{"$f":"IF(N$4=0,\"\",IF(Liste!N117=\"\",\"\",N$4/Liste!N$5*Liste!N117))","v":""},{"$f":"IF(O$4=0,\"\",IF(Liste!O117=\"\",\"\",O$4/Liste!O$5*Liste!O117))","v":""},{"$f":"IF(P$4=0,\"\",IF(Liste!P117=\"\",\"\",P$4/Liste!P$5*Liste!P117))","v":""},{"$f":"IF(Q$4=0,\"\",IF(Liste!Q117=\"\",\"\",Q$4/Liste!Q$5*Liste!Q117))","v":""}]
["",{"$f":"IF(Liste!B118=\"\",\"\",Liste!B118)","v":""},{"$f":"IF(Liste!C118=\"\",\"\",Liste!C118)","v":""},{"$f":"IF(Liste!D118=\"\",\"\",Liste!D118)","v":""},{"$f":"IF(E$4=0,\"\",IF(Liste!E118=\"\",\"\",E$4/Liste!E$5*Liste!E118))","v":""},{"$f":"IF(F$4=0,\"\",IF(Liste!F118=\"\",\"\",F$4/Liste!F$5*Liste!F118))","v":""},{"$f":"IF(G$4=0,\"\",IF(Liste!G118=\"\",\"\",G$4/Liste!G$5*Liste!G118))","v":""},{"$f":"IF(H$4=0,\"\",IF(Liste!H118=\"\",\"\",H$4/Liste!H$5*Liste!H118))","v":""},{"$f":"IF(I$4=0,\"\",IF(Liste!I118=\"\",\"\",I$4/Liste!I$5*Liste!I118))","v":""},{"$f":"IF(J$4=0,\"\",IF(Liste!J118=\"\",\"\",J$4/Liste!J$5*Liste!J118))","v":""},{"$f":"IF(K$4=0,\"\",IF(Liste!K118=\"\",\"\",K$4/Liste!K$5*Liste!K118))","v":""},{"$f":"IF(L$4=0,\"\",IF(Liste!L118=\"\",\"\",L$4/Liste!L$5*Liste!L118))","v":""},{"$f":"IF(M$4=0,\"\",IF(Liste!M118=\"\",\"\",M$4/Liste!M$5*Liste!M118))","v":""},{"$f":"IF(N$4=0,\"\",IF(Liste!N118=\"\",\"\",N$4/Liste!N$5*Liste!N118))","v":""},{"$f":"IF(O$4=0,\"\",IF(Liste!O118=\"\",\"\",O$4/Liste!O$5*Liste!O118))","v":""},{"$f":"IF(P$4=0,\"\",IF(Liste!P118=\"\",\"\",P$4/Liste!P$5*Liste!P118))","v":""},{"$f":"IF(Q$4=0,\"\",IF(Liste!Q118=\"\",\"\",Q$4/Liste!Q$5*Liste!Q118))","v":""}]
["",{"$f":"IF(Liste!B119=\"\",\"\",Liste!B119)","v":""},{"$f":"IF(Liste!C119=\"\",\"\",Liste!C119)","v":""},{"$f":"IF(Liste!D119=\"\",\"\",Liste!D119)","v":""},{"$f":"IF(E$4=0,\"\",IF(Liste!E119=\"\",\"\",E$4/Liste!E$5*Liste!E119))","v":""},{"$f":"IF(F$4=0,\"\",IF(Liste!F119=\"\",\"\",F$4/Liste!F$5*Liste!F119))","v":""},{"$f":"IF(G$4=0,\"\",IF(Liste!G119=\"\",\"\",G$4/Liste!G$5*Liste!G119))","v":""},{"$f":"IF(H$4=0,\"\",IF(Liste!H119=\"\",\"\",H$4/Liste!H$5*Liste!H119))","v":""},{"$f":"IF(I$4=0,\"\",IF(Liste!I119=\"\",\"\",I$4/Liste!I$5*Liste!I119))","v":""},{"$f":"IF(J$4=0,\"\",IF(Liste!J119=\"\",\"\",J$4/Liste!J$5*Liste!J119))","v":""},{"$f":"IF(K$4=0,\"\",IF(Liste!K119=\"\",\"\",K$4/Liste!K$5*Liste!K119))","v":""},{"$f":"IF(L$4=0,\"\",IF(Liste!L119=\"\",\"\",L$4/Liste!L$5*Liste!L119))","v":""},{"$f":"IF(M$4=0,\"\",IF(Liste!M119=\"\",\"\",M$4/Liste!M$5*Liste!M119))","v":""},{"$f":"IF(N$4=0,\"\",IF(Liste!N119=\"\",\"\",N$4/Liste!N$5*Liste!N119))","v":""},{"$f":"IF(O$4=0,\"\",IF(Liste!O119=\"\",\"\",O$4/Liste!O$5*Liste!O119))","v":""},{"$f":"IF(P$4=0,\"\",IF(Liste!P119=\"\",\"\",P$4/Liste!P$5*Liste!P119))","v":""},{"$f":"IF(Q$4=0,\"\",IF(Liste!Q119=\"\",\"\",Q$4/Liste!Q$5*Liste!Q119))","v":""}]
["",{"$f":"IF(Liste!B120=\"\",\"\",Liste!B120)","v":""},{"$f":"IF(Liste!C120=\"\",\"\",Liste!C120)","v":""},{"$f":"IF(Liste!D120=\"\",\"\",Liste!D120)","v":""},{"$f":"IF(E$4=0,\"\",IF(Liste!E120=\"\",\"\",E$4/Liste!E$5*Liste!E120))","v":""},{"$f":"IF(F$4=0,\"\",IF(Liste!F120=\"\",\"\",F$4/Liste!F$5*Liste!F120))","v":""},{"$f":"IF(G$4=0,\"\",IF(Liste!G120=\"\",\"\",G$4/Liste!G$5*Liste!G120))","v":""},{"$f":"IF(H$4=0,\"\",IF(Liste!H120=\"\",\"\",H$4/Liste!H$5*Liste!H120))","v":""},{"$f":"IF(I$4=0,\"\",IF(Liste!I120=\"\",\"\",I$4/Liste!I$5*Liste!I120))","v":""},{"$f":"IF(J$4=0,\"\",IF(Liste!J120=\"\",\"\",J$4/Liste!J$5*Liste!J120))","v":""},{"$f":"IF(K$4=0,\"\",IF(Liste!K120=\"\",\"\",K$4/Liste!K$5*Liste!K120))","v":""},{"$f":"IF(L$4=0,\"\",IF(Liste!L120=\"\",\"\",L$4/Liste!L$5*Liste!L120))","v":""},{"$f":"IF(M$4=0,\"\",IF(Liste!M120=\"\",\"\",M$4/Liste!M$5*Liste!M120))","v":""},{"$f":"IF(N$4=0,\"\",IF(Liste!N120=\"\",\"\",N$4/Liste!N$5*Liste!N120))","v":""},{"$f":"IF(O$4=0,\"\",IF(Liste!O120=\"\",\"\",O$4/Liste!O$5*Liste!O120))","v":""},{"$f":"IF(P$4=0,\"\",IF(Liste!P120=\"\",\"\",P$4/Liste!P$5*Liste!P120))","v":""},{"$f":"IF(Q$4=0,\"\",IF(Liste!Q120=\"\",\"\",Q$4/Liste!Q$5*Liste!Q120))","v":""}]
["",{"$f":"IF(Liste!B121=\"\",\"\",Liste!B121)","v":""},{"$f":"IF(Liste!C121=\"\",\"\",Liste!C121)","v":""},{"$f":"IF(Liste!D121=\"\",\"\",Liste!D121)","v":""},{"$f":"IF(E$4=0,\"\",IF(Liste!E121=\"\",\"\",E$4/Liste!E$5*Liste!E121))","v":""},{"$f":"IF(F$4=0,\"\",IF(Liste!F121=\"\",\"\",F$4/Liste!F$5*Liste!F121))","v":""},{"$f":"IF(G$4=0,\"\",IF(Liste!G121=\"\",\"\",G$4/Liste!G$5*Liste!G121))","v":""},{"$f":"IF(H$4=0,\"\",IF(Liste!H121=\"\",\"\",H$4/Liste!H$5*Liste!H121))","v":""},{"$f":"IF(I$4=0,\"\",IF(Liste!I121=\"\",\"\",I$4/Liste!I$5*Liste!I121))","v":""},{"$f":"IF(J$4=0,\"\",IF(Liste!J121=\"\",\"\",J$4/Liste!J$5*Liste!J121))","v":""},{"$f":"IF(K$4=0,\"\",IF(Liste!K121=\"\",\"\",K$4/Liste!K$5*Liste!K121))","v":""},{"$f":"IF(L$4=0,\"\",IF(Liste!L121=\"\",\"\",L$4/Liste!L$5*Liste!L121))","v":""},{"$f":"IF(M$4=0,\"\",IF(Liste!M121=\"\",\"\",M$4/Liste!M$5*Liste!M121))","v":""},{"$f":"IF(N$4=0,\"\",IF(Liste!N121=\"\",\"\",N$4/Liste!N$5*Liste!N121))","v":""},{"$f":"IF(O$4=0,\"\",IF(Liste!O121=\"\",\"\",O$4/Liste!O$5*Liste!O121))","v":""},{"$f":"IF(P$4=0,\"\",IF(Liste!P121=\"\",\"\",P$4/Liste!P$5*Liste!P121))","v":""},{"$f":"IF(Q$4=0,\"\",IF(Liste!Q121=\"\",\"\",Q$4/Liste!Q$5*Liste!Q121))","v":""}]
["",{"$f":"IF(Liste!B122=\"\",\"\",Liste!B122)","v":""},{"$f":"IF(Liste!C122=\"\",\"\",Liste!C122)","v":""},{"$f":"IF(Liste!D122=\"\",\"\",Liste!D122)","v":""},{"$f":"IF(E$4=0,\"\",IF(Liste!E122=\"\",\"\",E$4/Liste!E$5*Liste!E122))","v":""},{"$f":"IF(F$4=0,\"\",IF(Liste!F122=\"\",\"\",F$4/Liste!F$5*Liste!F122))","v":""},{"$f":"IF(G$4=0,\"\",IF(Liste!G122=\"\",\"\",G$4/Liste!G$5*Liste!G122))","v":""},{"$f":"IF(H$4=0,\"\",IF(Liste!H122=\"\",\"\",H$4/Liste!H$5*Liste!H122))","v":""},{"$f":"IF(I$4=0,\"\",IF(Liste!I122=\"\",\"\",I$4/Liste!I$5*Liste!I122))","v":""},{"$f":"IF(J$4=0,\"\",IF(Liste!J122=\"\",\"\",J$4/Liste!J$5*Liste!J122))","v":""},{"$f":"IF(K$4=0,\"\",IF(Liste!K122=\"\",\"\",K$4/Liste!K$5*Liste!K122))","v":""},{"$f":"IF(L$4=0,\"\",IF(Liste!L122=\"\",\"\",L$4/Liste!L$5*Liste!L122))","v":""},{"$f":"IF(M$4=0,\"\",IF(Liste!M122=\"\",\"\",M$4/Liste!M$5*Liste!M122))","v":""},{"$f":"IF(N$4=0,\"\",IF(Liste!N122=\"\",\"\",N$4/Liste!N$5*Liste!N122))","v":""},{"$f":"IF(O$4=0,\"\",IF(Liste!O122=\"\",\"\",O$4/Liste!O$5*Liste!O122))","v":""},{"$f":"IF(P$4=0,\"\",IF(Liste!P122=\"\",\"\",P$4/Liste!P$5*Liste!P122))","v":""},{"$f":"IF(Q$4=0,\"\",IF(Liste!Q122=\"\",\"\",Q$4/Liste!Q$5*Liste!Q122))","v":""}]
["",{"$f":"IF(Liste!B123=\"\",\"\",Liste!B123)","v":""},{"$f":"IF(Liste!C123=\"\",\"\",Liste!C123)","v":""},{"$f":"IF(Liste!D123=\"\",\"\",Liste!D123)","v":""},{"$f":"IF(E$4=0,\"\",IF(Liste!E123=\"\",\"\",E$4/Liste!E$5*Liste!E123))","v":""},{"$f":"IF(F$4=0,\"\",IF(Liste!F123=\"\",\"\",F$4/Liste!F$5*Liste!F123))","v":""},{"$f":"IF(G$4=0,\"\",IF(Liste!G123=\"\",\"\",G$4/Liste!G$5*Liste!G123))","v":""},{"$f":"IF(H$4=0,\"\",IF(Liste!H123=\"\",\"\",H$4/Liste!H$5*Liste!H123))","v":""},{"$f":"IF(I$4=0,\"\",IF(Liste!I123=\"\",\"\",I$4/Liste!I$5*Liste!I123))","v":""},{"$f":"IF(J$4=0,\"\",IF(Liste!J123=\"\",\"\",J$4/Liste!J$5*Liste!J123))","v":""},{"$f":"IF(K$4=0,\"\",IF(Liste!K123=\"\",\"\",K$4/Liste!K$5*Liste!K123))","v":""},{"$f":"IF(L$4=0,\"\",IF(Liste!L123=\"\",\"\",L$4/Liste!L$5*Liste!L123))","v":""},{"$f":"IF(M$4=0,\"\",IF(Liste!M123=\"\",\"\",M$4/Liste!M$5*Liste!M123))","v":""},{"$f":"IF(N$4=0,\"\",IF(Liste!N123=\"\",\"\",N$4/Liste!N$5*Liste!N123))","v":""},{"$f":"IF(O$4=0,\"\",IF(Liste!O123=\"\",\"\",O$4/Liste!O$5*Liste!O123))","v":""},{"$f":"IF(P$4=0,\"\",IF(Liste!P123=\"\",\"\",P$4/Liste!P$5*Liste!P123))","v":""},{"$f":"IF(Q$4=0,\"\",IF(Liste!Q123=\"\",\"\",Q$4/Liste!Q$5*Liste!Q123))","v":""}]
["",{"$f":"IF(Liste!B124=\"\",\"\",Liste!B124)","v":""},{"$f":"IF(Liste!C124=\"\",\"\",Liste!C124)","v":""},{"$f":"IF(Liste!D124=\"\",\"\",Liste!D124)","v":""},{"$f":"IF(E$4=0,\"\",IF(Liste!E124=\"\",\"\",E$4/Liste!E$5*Liste!E124))","v":""},{"$f":"IF(F$4=0,\"\",IF(Liste!F124=\"\",\"\",F$4/Liste!F$5*Liste!F124))","v":""},{"$f":"IF(G$4=0,\"\",IF(Liste!G124=\"\",\"\",G$4/Liste!G$5*Liste!G124))","v":""},{"$f":"IF(H$4=0,\"\",IF(Liste!H124=\"\",\"\",H$4/Liste!H$5*Liste!H124))","v":""},{"$f":"IF(I$4=0,\"\",IF(Liste!I124=\"\",\"\",I$4/Liste!I$5*Liste!I124))","v":""},{"$f":"IF(J$4=0,\"\",IF(Liste!J124=\"\",\"\",J$4/Liste!J$5*Liste!J124))","v":""},{"$f":"IF(K$4=0,\"\",IF(Liste!K124=\"\",\"\",K$4/Liste!K$5*Liste!K124))","v":""},{"$f":"IF(L$4=0,\"\",IF(Liste!L124=\"\",\"\",L$4/Liste!L$5*Liste!L124))","v":""},{"$f":"IF(M$4=0,\"\",IF(Liste!M124=\"\",\"\",M$4/Liste!M$5*Liste!M124))","v":""},{"$f":"IF(N$4=0,\"\",IF(Liste!N124=\"\",\"\",N$4/Liste!N$5*Liste!N124))","v":""},{"$f":"IF(O$4=0,\"\",IF(Liste!O124=\"\",\"\",O$4/Liste!O$5*Liste!O124))","v":""},{"$f":"IF(P$4=0,\"\",IF(Liste!P124=\"\",\"\",P$4/Liste!P$5*Liste!P124))","v":""},{"$f":"IF(Q$4=0,\"\",IF(Liste!Q124=\"\",\"\",Q$4/Liste!Q$5*Liste!Q124))","v":""}]
["",{"$f":"IF(Liste!B125=\"\",\"\",Liste!B125)","v":""},{"$f":"IF(Liste!C125=\"\",\"\",Liste!C125)","v":""},{"$f":"IF(Liste!D125=\"\",\"\",Liste!D125)","v":""},{"$f":"IF(E$4=0,\"\",IF(Liste!E125=\"\",\"\",E$4/Liste!E$5*Liste!E125))","v":""},{"$f":"IF(F$4=0,\"\",IF(Liste!F125=\"\",\"\",F$4/Liste!F$5*Liste!F125))","v":""},{"$f":"IF(G$4=0,\"\",IF(Liste!G125=\"\",\"\",G$4/Liste!G$5*Liste!G125))","v":""},{"$f":"IF(H$4=0,\"\",IF(Liste!H125=\"\",\"\",H$4/Liste!H$5*Liste!H125))","v":""},{"$f":"IF(I$4=0,\"\",IF(Liste!I125=\"\",\"\",I$4/Liste!I$5*Liste!I125))","v":""},{"$f":"IF(J$4=0,\"\",IF(Liste!J125=\"\",\"\",J$4/Liste!J$5*Liste!J125))","v":""},{"$f":"IF(K$4=0,\"\",IF(Liste!K125=\"\",\"\",K$4/Liste!K$5*Liste!K125))","v":""},{"$f":"IF(L$4=0,\"\",IF(Liste!L125=\"\",\"\",L$4/Liste!L$5*Liste!L125))","v":""},{"$f":"IF(M$4=0,\"\",IF(Liste!M125=\"\",\"\",M$4/Liste!M$5*Liste!M125))","v":""},{"$f":"IF(N$4=0,\"\",IF(Liste!N125=\"\",\"\",N$4/Liste!N$5*Liste!N125))","v":""},{"$f":"IF(O$4=0,\"\",IF(Liste!O125=\"\",\"\",O$4/Liste!O$5*Liste!O125))","v":""},{"$f":"IF(P$4=0,\"\",IF(Liste!P125=\"\",\"\",P$4/Liste!P$5*Liste!P125))","v":""},{"$f":"IF(Q$4=0,\"\",IF(Liste!Q125=\"\",\"\",Q$4/Liste!Q$5*Liste!Q125))","v":""}]
["",{"$f":"IF(Liste!B126=\"\",\"\",Liste!B126)","v":""},{"$f":"IF(Liste!C126=\"\",\"\",Liste!C126)","v":""},{"$f":"IF(Liste!D126=\"\",\"\",Liste!D126)","v":""},{"$f":"IF(E$4=0,\"\",IF(Liste!E126=\"\",\"\",E$4/Liste!E$5*Liste!E126))","v":""},{"$f":"IF(F$4=0,\"\",IF(Liste!F126=\"\",\"\",F$4/Liste!F$5*Liste!F126))","v":""},{"$f":"IF(G$4=0,\"\",IF(Liste!G126=\"\",\"\",G$4/Liste!G$5*Liste!G126))","v":""},{"$f":"IF(H$4=0,\"\",IF(Liste!H126=\"\",\"\",H$4/Liste!H$5*Liste!H126))","v":""},{"$f":"IF(I$4=0,\"\",IF(Liste!I126=\"\",\"\",I$4/Liste!I$5*Liste!I126))","v":""},{"$f":"IF(J$4=0,\"\",IF(Liste!J126=\"\",\"\",J$4/Liste!J$5*Liste!J126))","v":""},{"$f":"IF(K$4=0,\"\",IF(Liste!K126=\"\",\"\",K$4/Liste!K$5*Liste!K126))","v":""},{"$f":"IF(L$4=0,\"\",IF(Liste!L126=\"\",\"\",L$4/Liste!L$5*Liste!L126))","v":""},{"$f":"IF(M$4=0,\"\",IF(Liste!M126=\"\",\"\",M$4/Liste!M$5*Liste!M126))","v":""},{"$f":"IF(N$4=0,\"\",IF(Liste!N126=\"\",\"\",N$4/Liste!N$5*Liste!N126))","v":""},{"$f":"IF(O$4=0,\"\",IF(Liste!O126=\"\",\"\",O$4/Liste!O$5*Liste!O126))","v":""},{"$f":"IF(P$4=0,\"\",IF(Liste!P126=\"\",\"\",P$4/Liste!P$5*Liste!P126))","v":""},{"$f":"IF(Q$4=0,\"\",IF(Liste!Q126=\"\",\"\",Q$4/Liste!Q$5*Liste!Q126))","v":""}]
["",{"$f":"IF(Liste!B127=\"\",\"\",Liste!B127)","v":""},{"$f":"IF(Liste!C127=\"\",\"\",Liste!C127)","v":""},{"$f":"IF(Liste!D127=\"\",\"\",Liste!D127)","v":""},{"$f":"IF(E$4=0,\"\",IF(Liste!E127=\"\",\"\",E$4/Liste!E$5*Liste!E127))","v":""},{"$f":"IF(F$4=0,\"\",IF(Liste!F127=\"\",\"\",F$4/Liste!F$5*Liste!F127))","v":""},{"$f":"IF(G$4=0,\"\",IF(Liste!G127=\"\",\"\",G$4/Liste!G$5*Liste!G127))","v":""},{"$f":"IF(H$4=0,\"\",IF(Liste!H127=\"\",\"\",H$4/Liste!H$5*Liste!H127))","v":""},{"$f":"IF(I$4=0,\"\",IF(Liste!I127=\"\",\"\",I$4/Liste!I$5*Liste!I127))","v":""},{"$f":"IF(J$4=0,\"\",IF(Liste!J127=\"\",\"\",J$4/Liste!J$5*Liste!J127))","v":""},{"$f":"IF(K$4=0,\"\",IF(Liste!K127=\"\",\"\",K$4/Liste!K$5*Liste!K127))","v":""},{"$f":"IF(L$4=0,\"\",IF(Liste!L127=\"\",\"\",L$4/Liste!L$5*Liste!L127))","v":""},{"$f":"IF(M$4=0,\"\",IF(Liste!M127=\"\",\"\",M$4/Liste!M$5*Liste!M127))","v":""},{"$f":"IF(N$4=0,\"\",IF(Liste!N127=\"\",\"\",N$4/Liste!N$5*Liste!N127))","v":""},{"$f":"IF(O$4=0,\"\",IF(Liste!O127=\"\",\"\",O$4/Liste!O$5*Liste!O127))","v":""},{"$f":"IF(P$4=0,\"\",IF(Liste!P127=\"\",\"\",P$4/Liste!P$5*Liste!P127))","v":""},{"$f":"IF(Q$4=0,\"\",IF(Liste!Q127=\"\",\"\",Q$4/Liste!Q$5*Liste!Q127))","v":""}]
["",{"$f":"IF(Liste!B128=\"\",\"\",Liste!B128)","v":""},{"$f":"IF(Liste!C128=\"\",\"\",Liste!C128)","v":""},{"$f":"IF(Liste!D128=\"\",\"\",Liste!D128)","v":""},{"$f":"IF(E$4=0,\"\",IF(Liste!E128=\"\",\"\",E$4/Liste!E$5*Liste!E128))","v":""},{"$f":"IF(F$4=0,\"\",IF(Liste!F128=\"\",\"\",F$4/Liste!F$5*Liste!F128))","v":""},{"$f":"IF(G$4=0,\"\",IF(Liste!G128=\"\",\"\",G$4/Liste!G$5*Liste!G128))","v":""},{"$f":"IF(H$4=0,\"\",IF(Liste!H128=\"\",\"\",H$4/Liste!H$5*Liste!H128))","v":""},{"$f":"IF(I$4=0,\"\",IF(Liste!I128=\"\",\"\",I$4/Liste!I$5*Liste!I128))","v":""},{"$f":"IF(J$4=0,\"\",IF(Liste!J128=\"\",\"\",J$4/Liste!J$5*Liste!J128))","v":""},{"$f":"IF(K$4=0,\"\",IF(Liste!K128=\"\",\"\",K$4/Liste!K$5*Liste!K128))","v":""},{"$f":"IF(L$4=0,\"\",IF(Liste!L128=\"\",\"\",L$4/Liste!L$5*Liste!L128))","v":""},{"$f":"IF(M$4=0,\"\",IF(Liste!M128=\"\",\"\",M$4/Liste!M$5*Liste!M128))","v":""},{"$f":"IF(N$4=0,\"\",IF(Liste!N128=\"\",\"\",N$4/Liste!N$5*Liste!N128))","v":""},{"$f":"IF(O$4=0,\"\",IF(Liste!O128=\"\",\"\",O$4/Liste!O$5*Liste!O128))","v":""},{"$f":"IF(P$4=0,\"\",IF(Liste!P128=\"\",\"\",P$4/Liste!P$5*Liste!P128))","v":""},{"$f":"IF(Q$4=0,\"\",IF(Liste!Q128=\"\",\"\",Q$4/Liste!Q$5*Liste!Q128))","v":""}]
["",{"$f":"IF(Liste!B129=\"\",\"\",Liste!B129)","v":""},{"$f":"IF(Liste!C129=\"\",\"\",Liste!C129)","v":""},{"$f":"IF(Liste!D129=\"\",\"\",Liste!D129)","v":""},{"$f":"IF(E$4=0,\"\",IF(Liste!E129=\"\",\"\",E$4/Liste!E$5*Liste!E129))","v":""},{"$f":"IF(F$4=0,\"\",IF(Liste!F129=\"\",\"\",F$4/Liste!F$5*Liste!F129))","v":""},{"$f":"IF(G$4=0,\"\",IF(Liste!G129=\"\",\"\",G$4/Liste!G$5*Liste!G129))","v":""},{"$f":"IF(H$4=0,\"\",IF(Liste!H129=\"\",\"\",H$4/Liste!H$5*Liste!H129))","v":""},{"$f":"IF(I$4=0,\"\",IF(Liste!I129=\"\",\"\",I$4/Liste!I$5*Liste!I129))","v":""},{"$f":"IF(J$4=0,\"\",IF(Liste!J129=\"\",\"\",J$4/Liste!J$5*Liste!J129))","v":""},{"$f":"IF(K$4=0,\"\",IF(Liste!K129=\"\",\"\",K$4/Liste!K$5*Liste!K129))","v":""},{"$f":"IF(L$4=0,\"\",IF(Liste!L129=\"\",\"\",L$4/Liste!L$5*Liste!L129))","v":""},{"$f":"IF(M$4=0,\"\",IF(Liste!M129=\"\",\"\",M$4/Liste!M$5*Liste!M129))","v":""},{"$f":"IF(N$4=0,\"\",IF(Liste!N129=\"\",\"\",N$4/Liste!N$5*Liste!N129))","v":""},{"$f":"IF(O$4=0,\"\",IF(Liste!O129=\"\",\"\",O$4/Liste!O$5*Liste!O129))","v":""},{"$f":"IF(P$4=0,\"\",IF(Liste!P129=\"\",\"\",P$4/Liste!P$5*Liste!P129))","v":""},{"$f":"IF(Q$4=0,\"\",IF(Liste!Q129=\"\",\"\",Q$4/Liste!Q$5*Liste!Q129))","v":""}]
["",{"$f":"IF(Liste!B130=\"\",\"\",Liste!B130)","v":""},{"$f":"IF(Liste!C130=\"\",\"\",Liste!C130)","v":""},{"$f":"IF(Liste!D130=\"\",\"\",Liste!D130)","v":""},{"$f":"IF(E$4=0,\"\",IF(Liste!E130=\"\",\"\",E$4/Liste!E$5*Liste!E130))","v":""},{"$f":"IF(F$4=0,\"\",IF(Liste!F130=\"\",\"\",F$4/Liste!F$5*Liste!F130))","v":""},{"$f":"IF(G$4=0,\"\",IF(Liste!G130=\"\",\"\",G$4/Liste!G$5*Liste!G130))","v":""},{"$f":"IF(H$4=0,\"\",IF(Liste!H130=\"\",\"\",H$4/Liste!H$5*Liste!H130))","v":""},{"$f":"IF(I$4=0,\"\",IF(Liste!I130=\"\",\"\",I$4/Liste!I$5*Liste!I130))","v":""},{"$f":"IF(J$4=0,\"\",IF(Liste!J130=\"\",\"\",J$4/Liste!J$5*Liste!J130))","v":""},{"$f":"IF(K$4=0,\"\",IF(Liste!K130=\"\",\"\",K$4/Liste!K$5*Liste!K130))","v":""},{"$f":"IF(L$4=0,\"\",IF(Liste!L130=\"\",\"\",L$4/Liste!L$5*Liste!L130))","v":""},{"$f":"IF(M$4=0,\"\",IF(Liste!M130=\"\",\"\",M$4/Liste!M$5*Liste!M130))","v":""},{"$f":"IF(N$4=0,\"\",IF(Liste!N130=\"\",\"\",N$4/Liste!N$5*Liste!N130))","v":""},{"$f":"IF(O$4=0,\"\",IF(Liste!O130=\"\",\"\",O$4/Liste!O$5*Liste!O130))","v":""},{"$f":"IF(P$4=0,\"\",IF(Liste!P130=\"\",\"\",P$4/Liste!P$5*Liste!P130))","v":""},{"$f":"IF(Q$4=0,\"\",IF(Liste!Q130=\"\",\"\",Q$4/Liste!Q$5*Liste!Q130))","v":""}]
["",{"$f":"IF(Liste!B131=\"\",\"\",Liste!B131)","v":""},{"$f":"IF(Liste!C131=\"\",\"\",Liste!C131)","v":""},{"$f":"IF(Liste!D131=\"\",\"\",Liste!D131)","v":""},{"$f":"IF(E$4=0,\"\",IF(Liste!E131=\"\",\"\",E$4/Liste!E$5*Liste!E131))","v":""},{"$f":"IF(F$4=0,\"\",IF(Liste!F131=\"\",\"\",F$4/Liste!F$5*Liste!F131))","v":""},{"$f":"IF(G$4=0,\"\",IF(Liste!G131=\"\",\"\",G$4/Liste!G$5*Liste!G131))","v":""},{"$f":"IF(H$4=0,\"\",IF(Liste!H131=\"\",\"\",H$4/Liste!H$5*Liste!H131))","v":""},{"$f":"IF(I$4=0,\"\",IF(Liste!I131=\"\",\"\",I$4/Liste!I$5*Liste!I131))","v":""},{"$f":"IF(J$4=0,\"\",IF(Liste!J131=\"\",\"\",J$4/Liste!J$5*Liste!J131))","v":""},{"$f":"IF(K$4=0,\"\",IF(Liste!K131=\"\",\"\",K$4/Liste!K$5*Liste!K131))","v":""},{"$f":"IF(L$4=0,\"\",IF(Liste!L131=\"\",\"\",L$4/Liste!L$5*Liste!L131))","v":""},{"$f":"IF(M$4=0,\"\",IF(Liste!M131=\"\",\"\",M$4/Liste!M$5*Liste!M131))","v":""},{"$f":"IF(N$4=0,\"\",IF(Liste!N131=\"\",\"\",N$4/Liste!N$5*Liste!N131))","v":""},{"$f":"IF(O$4=0,\"\",IF(Liste!O131=\"\",\"\",O$4/Liste!O$5*Liste!O131))","v":""},{"$f":"IF(P$4=0,\"\",IF(Liste!P131=\"\",\"\",P$4/Liste!P$5*Liste!P131))","v":""},{"$f":"IF(Q$4=0,\"\",IF(Liste!Q131=\"\",\"\",Q$4/Liste!Q$5*Liste!Q131))","v":""}]
["",{"$f":"IF(Liste!B132=\"\",\"\",Liste!B132)","v":""},{"$f":"IF(Liste!C132=\"\",\"\",Liste!C132)","v":""},{"$f":"IF(Liste!D132=\"\",\"\",Liste!D132)","v":""},{"$f":"IF(E$4=0,\"\",IF(Liste!E132=\"\",\"\",E$4/Liste!E$5*Liste!E132))","v":""},{"$f":"IF(F$4=0,\"\",IF(Liste!F132=\"\",\"\",F$4/Liste!F$5*Liste!F132))","v":""},{"$f":"IF(G$4=0,\"\",IF(Liste!G132=\"\",\"\",G$4/Liste!G$5*Liste!G132))","v":""},{"$f":"IF(H$4=0,\"\",IF(Liste!H132=\"\",\"\",H$4/Liste!H$5*Liste!H132))","v":""},{"$f":"IF(I$4=0,\"\",IF(Liste!I132=\"\",\"\",I$4/Liste!I$5*Liste!I132))","v":""},{"$f":"IF(J$4=0,\"\",IF(Liste!J132=\"\",\"\",J$4/Liste!J$5*Liste!J132))","v":""},{"$f":"IF(K$4=0,\"\",IF(Liste!K132=\"\",\"\",K$4/Liste!K$5*Liste!K132))","v":""},{"$f":"IF(L$4=0,\"\",IF(Liste!L132=\"\",\"\",L$4/Liste!L$5*Liste!L132))","v":""},{"$f":"IF(M$4=0,\"\",IF(Liste!M132=\"\",\"\",M$4/Liste!M$5*Liste!M132))","v":""},{"$f":"IF(N$4=0,\"\",IF(Liste!N132=\"\",\"\",N$4/Liste!N$5*Liste!N132))","v":""},{"$f":"IF(O$4=0,\"\",IF(Liste!O132=\"\",\"\",O$4/Liste!O$5*Liste!O132))","v":""},{"$f":"IF(P$4=0,\"\",IF(Liste!P132=\"\",\"\",P$4/Liste!P$5*Liste!P132))","v":""},{"$f":"IF(Q$4=0,\"\",IF(Liste!Q132=\"\",\"\",Q$4/Liste!Q$5*Liste!Q132))","v":""}]
["",{"$f":"IF(Liste!B133=\"\",\"\",Liste!B133)","v":""},{"$f":"IF(Liste!C133=\"\",\"\",Liste!C133)","v":""},{"$f":"IF(Liste!D133=\"\",\"\",Liste!D133)","v":""},{"$f":"IF(E$4=0,\"\",IF(Liste!E133=\"\",\"\",E$4/Liste!E$5*Liste!E133))","v":""},{"$f":"IF(F$4=0,\"\",IF(Liste!F133=\"\",\"\",F$4/Liste!F$5*Liste!F133))","v":""},{"$f":"IF(G$4=0,\"\",IF(Liste!G133=\"\",\"\",G$4/Liste!G$5*Liste!G133))","v":""},{"$f":"IF(H$4=0,\"\",IF(Liste!H133=\"\",\"\",H$4/Liste!H$5*Liste!H133))","v":""},{"$f":"IF(I$4=0,\"\",IF(Liste!I133=\"\",\"\",I$4/Liste!I$5*Liste!I133))","v":""},{"$f":"IF(J$4=0,\"\",IF(Liste!J133=\"\",\"\",J$4/Liste!J$5*Liste!J133))","v":""},{"$f":"IF(K$4=0,\"\",IF(Liste!K133=\"\",\"\",K$4/Liste!K$5*Liste!K133))","v":""},{"$f":"IF(L$4=0,\"\",IF(Liste!L133=\"\",\"\",L$4/Liste!L$5*Liste!L133))","v":""},{"$f":"IF(M$4=0,\"\",IF(Liste!M133=\"\",\"\",M$4/Liste!M$5*Liste!M133))","v":""},{"$f":"IF(N$4=0,\"\",IF(Liste!N133=\"\",\"\",N$4/Liste!N$5*Liste!N133))","v":""},{"$f":"IF(O$4=0,\"\",IF(Liste!O133=\"\",\"\",O$4/Liste!O$5*Liste!O133))","v":""},{"$f":"IF(P$4=0,\"\",IF(Liste!P133=\"\",\"\",P$4/Liste!P$5*Liste!P133))","v":""},{"$f":"IF(Q$4=0,\"\",IF(Liste!Q133=\"\",\"\",Q$4/Liste!Q$5*Liste!Q133))","v":""}]
["",{"$f":"IF(Liste!B134=\"\",\"\",Liste!B134)","v":""},{"$f":"IF(Liste!C134=\"\",\"\",Liste!C134)","v":""},{"$f":"IF(Liste!D134=\"\",\"\",Liste!D134)","v":""},{"$f":"IF(E$4=0,\"\",IF(Liste!E134=\"\",\"\",E$4/Liste!E$5*Liste!E134))","v":""},{"$f":"IF(F$4=0,\"\",IF(Liste!F134=\"\",\"\",F$4/Liste!F$5*Liste!F134))","v":""},{"$f":"IF(G$4=0,\"\",IF(Liste!G134=\"\",\"\",G$4/Liste!G$5*Liste!G134))","v":""},{"$f":"IF(H$4=0,\"\",IF(Liste!H134=\"\",\"\",H$4/Liste!H$5*Liste!H134))","v":""},{"$f":"IF(I$4=0,\"\",IF(Liste!I134=\"\",\"\",I$4/Liste!I$5*Liste!I134))","v":""},{"$f":"IF(J$4=0,\"\",IF(Liste!J134=\"\",\"\",J$4/Liste!J$5*Liste!J134))","v":""},{"$f":"IF(K$4=0,\"\",IF(Liste!K134=\"\",\"\",K$4/Liste!K$5*Liste!K134))","v":""},{"$f":"IF(L$4=0,\"\",IF(Liste!L134=\"\",\"\",L$4/Liste!L$5*Liste!L134))","v":""},{"$f":"IF(M$4=0,\"\",IF(Liste!M134=\"\",\"\",M$4/Liste!M$5*Liste!M134))","v":""},{"$f":"IF(N$4=0,\"\",IF(Liste!N134=\"\",\"\",N$4/Liste!N$5*Liste!N134))","v":""},{"$f":"IF(O$4=0,\"\",IF(Liste!O134=\"\",\"\",O$4/Liste!O$5*Liste!O134))","v":""},{"$f":"IF(P$4=0,\"\",IF(Liste!P134=\"\",\"\",P$4/Liste!P$5*Liste!P134))","v":""},{"$f":"IF(Q$4=0,\"\",IF(Liste!Q134=\"\",\"\",Q$4/Liste!Q$5*Liste!Q134))","v":""}]
["",{"$f":"IF(Liste!B135=\"\",\"\",Liste!B135)","v":""},{"$f":"IF(Liste!C135=\"\",\"\",Liste!C135)","v":""},{"$f":"IF(Liste!D135=\"\",\"\",Liste!D135)","v":""},{"$f":"IF(E$4=0,\"\",IF(Liste!E135=\"\",\"\",E$4/Liste!E$5*Liste!E135))","v":""},{"$f":"IF(F$4=0,\"\",IF(Liste!F135=\"\",\"\",F$4/Liste!F$5*Liste!F135))","v":""},{"$f":"IF(G$4=0,\"\",IF(Liste!G135=\"\",\"\",G$4/Liste!G$5*Liste!G135))","v":""},{"$f":"IF(H$4=0,\"\",IF(Liste!H135=\"\",\"\",H$4/Liste!H$5*Liste!H135))","v":""},{"$f":"IF(I$4=0,\"\",IF(Liste!I135=\"\",\"\",I$4/Liste!I$5*Liste!I135))","v":""},{"$f":"IF(J$4=0,\"\",IF(Liste!J135=\"\",\"\",J$4/Liste!J$5*Liste!J135))","v":""},{"$f":"IF(K$4=0,\"\",IF(Liste!K135=\"\",\"\",K$4/Liste!K$5*Liste!K135))","v":""},{"$f":"IF(L$4=0,\"\",IF(Liste!L135=\"\",\"\",L$4/Liste!L$5*Liste!L135))","v":""},{"$f":"IF(M$4=0,\"\",IF(Liste!M135=\"\",\"\",M$4/Liste!M$5*Liste!M135))","v":""},{"$f":"IF(N$4=0,\"\",IF(Liste!N135=\"\",\"\",N$4/Liste!N$5*Liste!N135))","v":""},{"$f":"IF(O$4=0,\"\",IF(Liste!O135=\"\",\"\",O$4/Liste!O$5*Liste!O135))","v":""},{"$f":"IF(P$4=0,\"\",IF(Liste!P135=\"\",\"\",P$4/Liste!P$5*Liste!P135))","v":""},{"$f":"IF(Q$4=0,\"\",IF(Liste!Q135=\"\",\"\",Q$4/Liste!Q$5*Liste!Q135))","v":""}]
["",{"$f":"IF(Liste!B136=\"\",\"\",Liste!B136)","v":""},{"$f":"IF(Liste!C136=\"\",\"\",Liste!C136)","v":""},{"$f":"IF(Liste!D136=\"\",\"\",Liste!D136)","v":""},{"$f":"IF(E$4=0,\"\",IF(Liste!E136=\"\",\"\",E$4/Liste!E$5*Liste!E136))","v":""},{"$f":"IF(F$4=0,\"\",IF(Liste!F136=\"\",\"\",F$4/Liste!F$5*Liste!F136))","v":""},{"$f":"IF(G$4=0,\"\",IF(Liste!G136=\"\",\"\",G$4/Liste!G$5*Liste!G136))","v":""},{"$f":"IF(H$4=0,\"\",IF(Liste!H136=\"\",\"\",H$4/Liste!H$5*Liste!H136))","v":""},{"$f":"IF(I$4=0,\"\",IF(Liste!I136=\"\",\"\",I$4/Liste!I$5*Liste!I136))","v":""},{"$f":"IF(J$4=0,\"\",IF(Liste!J136=\"\",\"\",J$4/Liste!J$5*Liste!J136))","v":""},{"$f":"IF(K$4=0,\"\",IF(Liste!K136=\"\",\"\",K$4/Liste!K$5*Liste!K136))","v":""},{"$f":"IF(L$4=0,\"\",IF(Liste!L136=\"\",\"\",L$4/Liste!L$5*Liste!L136))","v":""},{"$f":"IF(M$4=0,\"\",IF(Liste!M136=\"\",\"\",M$4/Liste!M$5*Liste!M136))","v":""},{"$f":"IF(N$4=0,\"\",IF(Liste!N136=\"\",\"\",N$4/Liste!N$5*Liste!N136))","v":""},{"$f":"IF(O$4=0,\"\",IF(Liste!O136=\"\",\"\",O$4/Liste!O$5*Liste!O136))","v":""},{"$f":"IF(P$4=0,\"\",IF(Liste!P136=\"\",\"\",P$4/Liste!P$5*Liste!P136))","v":""},{"$f":"IF(Q$4=0,\"\",IF(Liste!Q136=\"\",\"\",Q$4/Liste!Q$5*Liste!Q136))","v":""}]
["",{"$f":"IF(Liste!B137=\"\",\"\",Liste!B137)","v":""},{"$f":"IF(Liste!C137=\"\",\"\",Liste!C137)","v":""},{"$f":"IF(Liste!D137=\"\",\"\",Liste!D137)","v":""},{"$f":"IF(E$4=0,\"\",IF(Liste!E137=\"\",\"\",E$4/Liste!E$5*Liste!E137))","v":""},{"$f":"IF(F$4=0,\"\",IF(Liste!F137=\"\",\"\",F$4/Liste!F$5*Liste!F137))","v":""},{"$f":"IF(G$4=0,\"\",IF(Liste!G137=\"\",\"\",G$4/Liste!G$5*Liste!G137))","v":""},{"$f":"IF(H$4=0,\"\",IF(Liste!H137=\"\",\"\",H$4/Liste!H$5*Liste!H137))","v":""},{"$f":"IF(I$4=0,\"\",IF(Liste!I137=\"\",\"\",I$4/Liste!I$5*Liste!I137))","v":""},{"$f":"IF(J$4=0,\"\",IF(Liste!J137=\"\",\"\",J$4/Liste!J$5*Liste!J137))","v":""},{"$f":"IF(K$4=0,\"\",IF(Liste!K137=\"\",\"\",K$4/Liste!K$5*Liste!K137))","v":""},{"$f":"IF(L$4=0,\"\",IF(Liste!L137=\"\",\"\",L$4/Liste!L$5*Liste!L137))","v":""},{"$f":"IF(M$4=0,\"\",IF(Liste!M137=\"\",\"\",M$4/Liste!M$5*Liste!M137))","v":""},{"$f":"IF(N$4=0,\"\",IF(Liste!N137=\"\",\"\",N$4/Liste!N$5*Liste!N137))","v":""},{"$f":"IF(O$4=0,\"\",IF(Liste!O137=\"\",\"\",O$4/Liste!O$5*Liste!O137))","v":""},{"$f":"IF(P$4=0,\"\",IF(Liste!P137=\"\",\"\",P$4/Liste!P$5*Liste!P137))","v":""},{"$f":"IF(Q$4=0,\"\",IF(Liste!Q137=\"\",\"\",Q$4/Liste!Q$5*Liste!Q137))","v":""}]
["",{"$f":"IF(Liste!B138=\"\",\"\",Liste!B138)","v":""},{"$f":"IF(Liste!C138=\"\",\"\",Liste!C138)","v":""},{"$f":"IF(Liste!D138=\"\",\"\",Liste!D138)","v":""},{"$f":"IF(E$4=0,\"\",IF(Liste!E138=\"\",\"\",E$4/Liste!E$5*Liste!E138))","v":""},{"$f":"IF(F$4=0,\"\",IF(Liste!F138=\"\",\"\",F$4/Liste!F$5*Liste!F138))","v":""},{"$f":"IF(G$4=0,\"\",IF(Liste!G138=\"\",\"\",G$4/Liste!G$5*Liste!G138))","v":""},{"$f":"IF(H$4=0,\"\",IF(Liste!H138=\"\",\"\",H$4/Liste!H$5*Liste!H138))","v":""},{"$f":"IF(I$4=0,\"\",IF(Liste!I138=\"\",\"\",I$4/Liste!I$5*Liste!I138))","v":""},{"$f":"IF(J$4=0,\"\",IF(Liste!J138=\"\",\"\",J$4/Liste!J$5*Liste!J138))","v":""},{"$f":"IF(K$4=0,\"\",IF(Liste!K138=\"\",\"\",K$4/Liste!K$5*Liste!K138))","v":""},{"$f":"IF(L$4=0,\"\",IF(Liste!L138=\"\",\"\",L$4/Liste!L$5*Liste!L138))","v":""},{"$f":"IF(M$4=0,\"\",IF(Liste!M138=\"\",\"\",M$4/Liste!M$5*Liste!M138))","v":""},{"$f":"IF(N$4=0,\"\",IF(Liste!N138=\"\",\"\",N$4/Liste!N$5*Liste!N138))","v":""},{"$f":"IF(O$4=0,\"\",IF(Liste!O138=\"\",\"\",O$4/Liste!O$5*Liste!O138))","v":""},{"$f":"IF(P$4=0,\"\",IF(Liste!P138=\"\",\"\",P$4/Liste!P$5*Liste!P138))","v":""},{"$f":"IF(Q$4=0,\"\",IF(Liste!Q138=\"\",\"\",Q$4/Liste!Q$5*Liste!Q138))","v":""}]
["",{"$f":"IF(Liste!B139=\"\",\"\",Liste!B139)","v":""},{"$f":"IF(Liste!C139=\"\",\"\",Liste!C139)","v":""},{"$f":"IF(Liste!D139=\"\",\"\",Liste!D139)","v":""},{"$f":"IF(E$4=0,\"\",IF(Liste!E139=\"\",\"\",E$4/Liste!E$5*Liste!E139))","v":""},{"$f":"IF(F$4=0,\"\",IF(Liste!F139=\"\",\"\",F$4/Liste!F$5*Liste!F139))","v":""},{"$f":"IF(G$4=0,\"\",IF(Liste!G139=\"\",\"\",G$4/Liste!G$5*Liste!G139))","v":""},{"$f":"IF(H$4=0,\"\",IF(Liste!H139=\"\",\"\",H$4/Liste!H$5*Liste!H139))","v":""},{"$f":"IF(I$4=0,\"\",IF(Liste!I139=\"\",\"\",I$4/Liste!I$5*Liste!I139))","v":""},{"$f":"IF(J$4=0,\"\",IF(Liste!J139=\"\",\"\",J$4/Liste!J$5*Liste!J139))","v":""},{"$f":"IF(K$4=0,\"\",IF(Liste!K139=\"\",\"\",K$4/Liste!K$5*Liste!K139))","v":""},{"$f":"IF(L$4=0,\"\",IF(Liste!L139=\"\",\"\",L$4/Liste!L$5*Liste!L139))","v":""},{"$f":"IF(M$4=0,\"\",IF(Liste!M139=\"\",\"\",M$4/Liste!M$5*Liste!M139))","v":""},{"$f":"IF(N$4=0,\"\",IF(Liste!N139=\"\",\"\",N$4/Liste!N$5*Liste!N139))","v":""},{"$f":"IF(O$4=0,\"\",IF(Liste!O139=\"\",\"\",O$4/Liste!O$5*Liste!O139))","v":""},{"$f":"IF(P$4=0,\"\",IF(Liste!P139=\"\",\"\",P$4/Liste!P$5*Liste!P139))","v":""},{"$f":"IF(Q$4=0,\"\",IF(Liste!Q139=\"\",\"\",Q$4/Liste!Q$5*Liste!Q139))","v":""}]
["",{"$f":"IF(Liste!B140=\"\",\"\",Liste!B140)","v":""},{"$f":"IF(Liste!C140=\"\",\"\",Liste!C140)","v":""},{"$f":"IF(Liste!D140=\"\",\"\",Liste!D140)","v":""},{"$f":"IF(E$4=0,\"\",IF(Liste!E140=\"\",\"\",E$4/Liste!E$5*Liste!E140))","v":""},{"$f":"IF(F$4=0,\"\",IF(Liste!F140=\"\",\"\",F$4/Liste!F$5*Liste!F140))","v":""},{"$f":"IF(G$4=0,\"\",IF(Liste!G140=\"\",\"\",G$4/Liste!G$5*Liste!G140))","v":""},{"$f":"IF(H$4=0,\"\",IF(Liste!H140=\"\",\"\",H$4/Liste!H$5*Liste!H140))","v":""},{"$f":"IF(I$4=0,\"\",IF(Liste!I140=\"\",\"\",I$4/Liste!I$5*Liste!I140))","v":""},{"$f":"IF(J$4=0,\"\",IF(Liste!J140=\"\",\"\",J$4/Liste!J$5*Liste!J140))","v":""},{"$f":"IF(K$4=0,\"\",IF(Liste!K140=\"\",\"\",K$4/Liste!K$5*Liste!K140))","v":""},{"$f":"IF(L$4=0,\"\",IF(Liste!L140=\"\",\"\",L$4/Liste!L$5*Liste!L140))","v":""},{"$f":"IF(M$4=0,\"\",IF(Liste!M140=\"\",\"\",M$4/Liste!M$5*Liste!M140))","v":""},{"$f":"IF(N$4=0,\"\",IF(Liste!N140=\"\",\"\",N$4/Liste!N$5*Liste!N140))","v":""},{"$f":"IF(O$4=0,\"\",IF(Liste!O140=\"\",\"\",O$4/Liste!O$5*Liste!O140))","v":""},{"$f":"IF(P$4=0,\"\",IF(Liste!P140=\"\",\"\",P$4/Liste!P$5*Liste!P140))","v":""},{"$f":"IF(Q$4=0,\"\",IF(Liste!Q140=\"\",\"\",Q$4/Liste!Q$5*Liste!Q140))","v":""}]
[{"$f":"IF(SUM(E136:H136)=0,\"\",SUM(E136:H136))","v":""},{"$f":"IF(Liste!B141=\"\",\"\",Liste!B141)","v":""},{"$f":"IF(Liste!C141=\"\",\"\",Liste!C141)","v":""},{"$f":"IF(Liste!D141=\"\",\"\",Liste!D141)","v":""},{"$f":"IF(E$4=0,\"\",IF(Liste!E141=\"\",\"\",E$4/Liste!E$5*Liste!E141))","v":""},{"$f":"IF(F$4=0,\"\",IF(Liste!F141=\"\",\"\",F$4/Liste!F$5*Liste!F141))","v":""},{"$f":"IF(G$4=0,\"\",IF(Liste!G141=\"\",\"\",G$4/Liste!G$5*Liste!G141))","v":""},{"$f":"IF(H$4=0,\"\",IF(Liste!H141=\"\",\"\",H$4/Liste!H$5*Liste!H141))","v":""},{"$f":"IF(I$4=0,\"\",IF(Liste!I141=\"\",\"\",I$4/Liste!I$5*Liste!I141))","v":""},{"$f":"IF(J$4=0,\"\",IF(Liste!J141=\"\",\"\",J$4/Liste!J$5*Liste!J141))","v":""},{"$f":"IF(K$4=0,\"\",IF(Liste!K141=\"\",\"\",K$4/Liste!K$5*Liste!K141))","v":""},{"$f":"IF(L$4=0,\"\",IF(Liste!L141=\"\",\"\",L$4/Liste!L$5*Liste!L141))","v":""},{"$f":"IF(M$4=0,\"\",IF(Liste!M141=\"\",\"\",M$4/Liste!M$5*Liste!M141))","v":""},{"$f":"IF(N$4=0,\"\",IF(Liste!N141=\"\",\"\",N$4/Liste!N$5*Liste!N141))","v":""},{"$f":"IF(O$4=0,\"\",IF(Liste!O141=\"\",\"\",O$4/Liste!O$5*Liste!O141))","v":""},{"$f":"IF(P$4=0,\"\",IF(Liste!P141=\"\",\"\",P$4/Liste!P$5*Liste!P141))","v":""},{"$f":"IF(Q$4=0,\"\",IF(Liste!Q141=\"\",\"\",Q$4/Liste!Q$5*Liste!Q141))","v":""}]
["",{"$f":"IF(Liste!B142=\"\",\"\",Liste!B142)","v":""},{"$f":"IF(Liste!C142=\"\",\"\",Liste!C142)","v":""},{"$f":"IF(Liste!D142=\"\",\"\",Liste!D142)","v":""},{"$f":"IF(E$4=0,\"\",IF(Liste!E142=\"\",\"\",E$4/Liste!E$5*Liste!E142))","v":""},{"$f":"IF(F$4=0,\"\",IF(Liste!F142=\"\",\"\",F$4/Liste!F$5*Liste!F142))","v":""},{"$f":"IF(G$4=0,\"\",IF(Liste!G142=\"\",\"\",G$4/Liste!G$5*Liste!G142))","v":""},{"$f":"IF(H$4=0,\"\",IF(Liste!H142=\"\",\"\",H$4/Liste!H$5*Liste!H142))","v":""},{"$f":"IF(I$4=0,\"\",IF(Liste!I142=\"\",\"\",I$4/Liste!I$5*Liste!I142))","v":""},{"$f":"IF(J$4=0,\"\",IF(Liste!J142=\"\",\"\",J$4/Liste!J$5*Liste!J142))","v":""},{"$f":"IF(K$4=0,\"\",IF(Liste!K142=\"\",\"\",K$4/Liste!K$5*Liste!K142))","v":""},{"$f":"IF(L$4=0,\"\",IF(Liste!L142=\"\",\"\",L$4/Liste!L$5*Liste!L142))","v":""},{"$f":"IF(M$4=0,\"\",IF(Liste!M142=\"\",\"\",M$4/Liste!M$5*Liste!M142))","v":""},{"$f":"IF(N$4=0,\"\",IF(Liste!N142=\"\",\"\",N$4/Liste!N$5*Liste!N142))","v":""},{"$f":"IF(O$4=0,\"\",IF(Liste!O142=\"\",\"\",O$4/Liste!O$5*Liste!O142))","v":""},{"$f":"IF(P$4=0,\"\",IF(Liste!P142=\"\",\"\",P$4/Liste!P$5*Liste!P142))","v":""},{"$f":"IF(Q$4=0,\"\",IF(Liste!Q142=\"\",\"\",Q$4/Liste!Q$5*Liste!Q142))","v":""}]
["",{"$f":"IF(Liste!B143=\"\",\"\",Liste!B143)","v":""},{"$f":"IF(Liste!C143=\"\",\"\",Liste!C143)","v":""},{"$f":"IF(Liste!D143=\"\",\"\",Liste!D143)","v":""},{"$f":"IF(E$4=0,\"\",IF(Liste!E143=\"\",\"\",E$4/Liste!E$5*Liste!E143))","v":""},{"$f":"IF(F$4=0,\"\",IF(Liste!F143=\"\",\"\",F$4/Liste!F$5*Liste!F143))","v":""},{"$f":"IF(G$4=0,\"\",IF(Liste!G143=\"\",\"\",G$4/Liste!G$5*Liste!G143))","v":""},{"$f":"IF(H$4=0,\"\",IF(Liste!H143=\"\",\"\",H$4/Liste!H$5*Liste!H143))","v":""},{"$f":"IF(I$4=0,\"\",IF(Liste!I143=\"\",\"\",I$4/Liste!I$5*Liste!I143))","v":""},{"$f":"IF(J$4=0,\"\",IF(Liste!J143=\"\",\"\",J$4/Liste!J$5*Liste!J143))","v":""},{"$f":"IF(K$4=0,\"\",IF(Liste!K143=\"\",\"\",K$4/Liste!K$5*Liste!K143))","v":""},{"$f":"IF(L$4=0,\"\",IF(Liste!L143=\"\",\"\",L$4/Liste!L$5*Liste!L143))","v":""},{"$f":"IF(M$4=0,\"\",IF(Liste!M143=\"\",\"\",M$4/Liste!M$5*Liste!M143))","v":""},{"$f":"IF(N$4=0,\"\",IF(Liste!N143=\"\",\"\",N$4/Liste!N$5*Liste!N143))","v":""},{"$f":"IF(O$4=0,\"\",IF(Liste!O143=\"\",\"\",O$4/Liste!O$5*Liste!O143))","v":""},{"$f":"IF(P$4=0,\"\",IF(Liste!P143=\"\",\"\",P$4/Liste!P$5*Liste!P143))","v":""},{"$f":"IF(Q$4=0,\"\",IF(Liste!Q143=\"\",\"\",Q$4/Liste!Q$5*Liste!Q143))","v":""}]
["",{"$f":"IF(Liste!B144=\"\",\"\",Liste!B144)","v":""},{"$f":"IF(Liste!C144=\"\",\"\",Liste!C144)","v":""},{"$f":"IF(Liste!D144=\"\",\"\",Liste!D144)","v":""},{"$f":"IF(E$4=0,\"\",IF(Liste!E144=\"\",\"\",E$4/Liste!E$5*Liste!E144))","v":""},{"$f":"IF(F$4=0,\"\",IF(Liste!F144=\"\",\"\",F$4/Liste!F$5*Liste!F144))","v":""},{"$f":"IF(G$4=0,\"\",IF(Liste!G144=\"\",\"\",G$4/Liste!G$5*Liste!G144))","v":""},{"$f":"IF(H$4=0,\"\",IF(Liste!H144=\"\",\"\",H$4/Liste!H$5*Liste!H144))","v":""},{"$f":"IF(I$4=0,\"\",IF(Liste!I144=\"\",\"\",I$4/Liste!I$5*Liste!I144))","v":""},{"$f":"IF(J$4=0,\"\",IF(Liste!J144=\"\",\"\",J$4/Liste!J$5*Liste!J144))","v":""},{"$f":"IF(K$4=0,\"\",IF(Liste!K144=\"\",\"\",K$4/Liste!K$5*Liste!K144))","v":""},{"$f":"IF(L$4=0,\"\",IF(Liste!L144=\"\",\"\",L$4/Liste!L$5*Liste!L144))","v":""},{"$f":"IF(M$4=0,\"\",IF(Liste!M144=\"\",\"\",M$4/Liste!M$5*Liste!M144))","v":""},{"$f":"IF(N$4=0,\"\",IF(Liste!N144=\"\",\"\",N$4/Liste!N$5*Liste!N144))","v":""},{"$f":"IF(O$4=0,\"\",IF(Liste!O144=\"\",\"\",O$4/Liste!O$5*Liste!O144))","v":""},{"$f":"IF(P$4=0,\"\",IF(Liste!P144=\"\",\"\",P$4/Liste!P$5*Liste!P144))","v":""},{"$f":"IF(Q$4=0,\"\",IF(Liste!Q144=\"\",\"\",Q$4/Liste!Q$5*Liste!Q144))","v":""}]
["",{"$f":"IF(Liste!B145=\"\",\"\",Liste!B145)","v":""},{"$f":"IF(Liste!C145=\"\",\"\",Liste!C145)","v":""},{"$f":"IF(Liste!D145=\"\",\"\",Liste!D145)","v":""},{"$f":"IF(E$4=0,\"\",IF(Liste!E145=\"\",\"\",E$4/Liste!E$5*Liste!E145))","v":""},{"$f":"IF(F$4=0,\"\",IF(Liste!F145=\"\",\"\",F$4/Liste!F$5*Liste!F145))","v":""},{"$f":"IF(G$4=0,\"\",IF(Liste!G145=\"\",\"\",G$4/Liste!G$5*Liste!G145))","v":""},{"$f":"IF(H$4=0,\"\",IF(Liste!H145=\"\",\"\",H$4/Liste!H$5*Liste!H145))","v":""},{"$f":"IF(I$4=0,\"\",IF(Liste!I145=\"\",\"\",I$4/Liste!I$5*Liste!I145))","v":""},{"$f":"IF(J$4=0,\"\",IF(Liste!J145=\"\",\"\",J$4/Liste!J$5*Liste!J145))","v":""},{"$f":"IF(K$4=0,\"\",IF(Liste!K145=\"\",\"\",K$4/Liste!K$5*Liste!K145))","v":""},{"$f":"IF(L$4=0,\"\",IF(Liste!L145=\"\",\"\",L$4/Liste!L$5*Liste!L145))","v":""},{"$f":"IF(M$4=0,\"\",IF(Liste!M145=\"\",\"\",M$4/Liste!M$5*Liste!M145))","v":""},{"$f":"IF(N$4=0,\"\",IF(Liste!N145=\"\",\"\",N$4/Liste!N$5*Liste!N145))","v":""},{"$f":"IF(O$4=0,\"\",IF(Liste!O145=\"\",\"\",O$4/Liste!O$5*Liste!O145))","v":""},{"$f":"IF(P$4=0,\"\",IF(Liste!P145=\"\",\"\",P$4/Liste!P$5*Liste!P145))","v":""},{"$f":"IF(Q$4=0,\"\",IF(Liste!Q145=\"\",\"\",Q$4/Liste!Q$5*Liste!Q145))","v":""}]
["",{"$f":"IF(Liste!B146=\"\",\"\",Liste!B146)","v":""},{"$f":"IF(Liste!C146=\"\",\"\",Liste!C146)","v":""},{"$f":"IF(Liste!D146=\"\",\"\",Liste!D146)","v":""},{"$f":"IF(E$4=0,\"\",IF(Liste!E146=\"\",\"\",E$4/Liste!E$5*Liste!E146))","v":""},{"$f":"IF(F$4=0,\"\",IF(Liste!F146=\"\",\"\",F$4/Liste!F$5*Liste!F146))","v":""},{"$f":"IF(G$4=0,\"\",IF(Liste!G146=\"\",\"\",G$4/Liste!G$5*Liste!G146))","v":""},{"$f":"IF(H$4=0,\"\",IF(Liste!H146=\"\",\"\",H$4/Liste!H$5*Liste!H146))","v":""},{"$f":"IF(I$4=0,\"\",IF(Liste!I146=\"\",\"\",I$4/Liste!I$5*Liste!I146))","v":""},{"$f":"IF(J$4=0,\"\",IF(Liste!J146=\"\",\"\",J$4/Liste!J$5*Liste!J146))","v":""},{"$f":"IF(K$4=0,\"\",IF(Liste!K146=\"\",\"\",K$4/Liste!K$5*Liste!K146))","v":""},{"$f":"IF(L$4=0,\"\",IF(Liste!L146=\"\",\"\",L$4/Liste!L$5*Liste!L146))","v":""},{"$f":"IF(M$4=0,\"\",IF(Liste!M146=\"\",\"\",M$4/Liste!M$5*Liste!M146))","v":""},{"$f":"IF(N$4=0,\"\",IF(Liste!N146=\"\",\"\",N$4/Liste!N$5*Liste!N146))","v":""},{"$f":"IF(O$4=0,\"\",IF(Liste!O146=\"\",\"\",O$4/Liste!O$5*Liste!O146))","v":""},{"$f":"IF(P$4=0,\"\",IF(Liste!P146=\"\",\"\",P$4/Liste!P$5*Liste!P146))","v":""},{"$f":"IF(Q$4=0,\"\",IF(Liste!Q146=\"\",\"\",Q$4/Liste!Q$5*Liste!Q146))","v":""}]
["",{"$f":"IF(Liste!B147=\"\",\"\",Liste!B147)","v":""},{"$f":"IF(Liste!C147=\"\",\"\",Liste!C147)","v":""},{"$f":"IF(Liste!D147=\"\",\"\",Liste!D147)","v":""},{"$f":"IF(E$4=0,\"\",IF(Liste!E147=\"\",\"\",E$4/Liste!E$5*Liste!E147))","v":""},{"$f":"IF(F$4=0,\"\",IF(Liste!F147=\"\",\"\",F$4/Liste!F$5*Liste!F147))","v":""},{"$f":"IF(G$4=0,\"\",IF(Liste!G147=\"\",\"\",G$4/Liste!G$5*Liste!G147))","v":""},{"$f":"IF(H$4=0,\"\",IF(Liste!H147=\"\",\"\",H$4/Liste!H$5*Liste!H147))","v":""},{"$f":"IF(I$4=0,\"\",IF(Liste!I147=\"\",\"\",I$4/Liste!I$5*Liste!I147))","v":""},{"$f":"IF(J$4=0,\"\",IF(Liste!J147=\"\",\"\",J$4/Liste!J$5*Liste!J147))","v":""},{"$f":"IF(K$4=0,\"\",IF(Liste!K147=\"\",\"\",K$4/Liste!K$5*Liste!K147))","v":""},{"$f":"IF(L$4=0,\"\",IF(Liste!L147=\"\",\"\",L$4/Liste!L$5*Liste!L147))","v":""},{"$f":"IF(M$4=0,\"\",IF(Liste!M147=\"\",\"\",M$4/Liste!M$5*Liste!M147))","v":""},{"$f":"IF(N$4=0,\"\",IF(Liste!N147=\"\",\"\",N$4/Liste!N$5*Liste!N147))","v":""},{"$f":"IF(O$4=0,\"\",IF(Liste!O147=\"\",\"\",O$4/Liste!O$5*Liste!O147))","v":""},{"$f":"IF(P$4=0,\"\",IF(Liste!P147=\"\",\"\",P$4/Liste!P$5*Liste!P147))","v":""},{"$f":"IF(Q$4=0,\"\",IF(Liste!Q147=\"\",\"\",Q$4/Liste!Q$5*Liste!Q147))","v":""}]
["",{"$f":"IF(Liste!B148=\"\",\"\",Liste!B148)","v":""},{"$f":"IF(Liste!C148=\"\",\"\",Liste!C148)","v":""},{"$f":"IF(Liste!D148=\"\",\"\",Liste!D148)","v":""},{"$f":"IF(E$4=0,\"\",IF(Liste!E148=\"\",\"\",E$4/Liste!E$5*Liste!E148))","v":""},{"$f":"IF(F$4=0,\"\",IF(Liste!F148=\"\",\"\",F$4/Liste!F$5*Liste!F148))","v":""},{"$f":"IF(G$4=0,\"\",IF(Liste!G148=\"\",\"\",G$4/Liste!G$5*Liste!G148))","v":""},{"$f":"IF(H$4=0,\"\",IF(Liste!H148=\"\",\"\",H$4/Liste!H$5*Liste!H148))","v":""},{"$f":"IF(I$4=0,\"\",IF(Liste!I148=\"\",\"\",I$4/Liste!I$5*Liste!I148))","v":""},{"$f":"IF(J$4=0,\"\",IF(Liste!J148=\"\",\"\",J$4/Liste!J$5*Liste!J148))","v":""},{"$f":"IF(K$4=0,\"\",IF(Liste!K148=\"\",\"\",K$4/Liste!K$5*Liste!K148))","v":""},{"$f":"IF(L$4=0,\"\",IF(Liste!L148=\"\",\"\",L$4/Liste!L$5*Liste!L148))","v":""},{"$f":"IF(M$4=0,\"\",IF(Liste!M148=\"\",\"\",M$4/Liste!M$5*Liste!M148))","v":""},{"$f":"IF(N$4=0,\"\",IF(Liste!N148=\"\",\"\",N$4/Liste!N$5*Liste!N148))","v":""},{"$f":"IF(O$4=0,\"\",IF(Liste!O148=\"\",\"\",O$4/Liste!O$5*Liste!O148))","v":""},{"$f":"IF(P$4=0,\"\",IF(Liste!P148=\"\",\"\",P$4/Liste!P$5*Liste!P148))","v":""},{"$f":"IF(Q$4=0,\"\",IF(Liste!Q148=\"\",\"\",Q$4/Liste!Q$5*Liste!Q148))","v":""}]
["",{"$f":"IF(Liste!B149=\"\",\"\",Liste!B149)","v":""},{"$f":"IF(Liste!C149=\"\",\"\",Liste!C149)","v":""},{"$f":"IF(Liste!D149=\"\",\"\",Liste!D149)","v":""},{"$f":"IF(E$4=0,\"\",IF(Liste!E149=\"\",\"\",E$4/Liste!E$5*Liste!E149))","v":""},{"$f":"IF(F$4=0,\"\",IF(Liste!F149=\"\",\"\",F$4/Liste!F$5*Liste!F149))","v":""},{"$f":"IF(G$4=0,\"\",IF(Liste!G149=\"\",\"\",G$4/Liste!G$5*Liste!G149))","v":""},{"$f":"IF(H$4=0,\"\",IF(Liste!H149=\"\",\"\",H$4/Liste!H$5*Liste!H149))","v":""},{"$f":"IF(I$4=0,\"\",IF(Liste!I149=\"\",\"\",I$4/Liste!I$5*Liste!I149))","v":""},{"$f":"IF(J$4=0,\"\",IF(Liste!J149=\"\",\"\",J$4/Liste!J$5*Liste!J149))","v":""},{"$f":"IF(K$4=0,\"\",IF(Liste!K149=\"\",\"\",K$4/Liste!K$5*Liste!K149))","v":""},{"$f":"IF(L$4=0,\"\",IF(Liste!L149=\"\",\"\",L$4/Liste!L$5*Liste!L149))","v":""},{"$f":"IF(M$4=0,\"\",IF(Liste!M149=\"\",\"\",M$4/Liste!M$5*Liste!M149))","v":""},{"$f":"IF(N$4=0,\"\",IF(Liste!N149=\"\",\"\",N$4/Liste!N$5*Liste!N149))","v":""},{"$f":"IF(O$4=0,\"\",IF(Liste!O149=\"\",\"\",O$4/Liste!O$5*Liste!O149))","v":""},{"$f":"IF(P$4=0,\"\",IF(Liste!P149=\"\",\"\",P$4/Liste!P$5*Liste!P149))","v":""},{"$f":"IF(Q$4=0,\"\",IF(Liste!Q149=\"\",\"\",Q$4/Liste!Q$5*Liste!Q149))","v":""}]
["",{"$f":"IF(Liste!B150=\"\",\"\",Liste!B150)","v":""},{"$f":"IF(Liste!C150=\"\",\"\",Liste!C150)","v":""},{"$f":"IF(Liste!D150=\"\",\"\",Liste!D150)","v":""},{"$f":"IF(E$4=0,\"\",IF(Liste!E150=\"\",\"\",E$4/Liste!E$5*Liste!E150))","v":""},{"$f":"IF(F$4=0,\"\",IF(Liste!F150=\"\",\"\",F$4/Liste!F$5*Liste!F150))","v":""},{"$f":"IF(G$4=0,\"\",IF(Liste!G150=\"\",\"\",G$4/Liste!G$5*Liste!G150))","v":""},{"$f":"IF(H$4=0,\"\",IF(Liste!H150=\"\",\"\",H$4/Liste!H$5*Liste!H150))","v":""},{"$f":"IF(I$4=0,\"\",IF(Liste!I150=\"\",\"\",I$4/Liste!I$5*Liste!I150))","v":""},{"$f":"IF(J$4=0,\"\",IF(Liste!J150=\"\",\"\",J$4/Liste!J$5*Liste!J150))","v":""},{"$f":"IF(K$4=0,\"\",IF(Liste!K150=\"\",\"\",K$4/Liste!K$5*Liste!K150))","v":""},{"$f":"IF(L$4=0,\"\",IF(Liste!L150=\"\",\"\",L$4/Liste!L$5*Liste!L150))","v":""},{"$f":"IF(M$4=0,\"\",IF(Liste!M150=\"\",\"\",M$4/Liste!M$5*Liste!M150))","v":""},{"$f":"IF(N$4=0,\"\",IF(Liste!N150=\"\",\"\",N$4/Liste!N$5*Liste!N150))","v":""},{"$f":"IF(O$4=0,\"\",IF(Liste!O150=\"\",\"\",O$4/Liste!O$5*Liste!O150))","v":""},{"$f":"IF(P$4=0,\"\",IF(Liste!P150=\"\",\"\",P$4/Liste!P$5*Liste!P150))","v":""},{"$f":"IF(Q$4=0,\"\",IF(Liste!Q150=\"\",\"\",Q$4/Liste!Q$5*Liste!Q150))","v":""}]
["",{"$f":"IF(Liste!B151=\"\",\"\",Liste!B151)","v":""},{"$f":"IF(Liste!C151=\"\",\"\",Liste!C151)","v":""},{"$f":"IF(Liste!D151=\"\",\"\",Liste!D151)","v":""},{"$f":"IF(E$4=0,\"\",IF(Liste!E151=\"\",\"\",E$4/Liste!E$5*Liste!E151))","v":""},{"$f":"IF(F$4=0,\"\",IF(Liste!F151=\"\",\"\",F$4/Liste!F$5*Liste!F151))","v":""},{"$f":"IF(G$4=0,\"\",IF(Liste!G151=\"\",\"\",G$4/Liste!G$5*Liste!G151))","v":""},{"$f":"IF(H$4=0,\"\",IF(Liste!H151=\"\",\"\",H$4/Liste!H$5*Liste!H151))","v":""},{"$f":"IF(I$4=0,\"\",IF(Liste!I151=\"\",\"\",I$4/Liste!I$5*Liste!I151))","v":""},{"$f":"IF(J$4=0,\"\",IF(Liste!J151=\"\",\"\",J$4/Liste!J$5*Liste!J151))","v":""},{"$f":"IF(K$4=0,\"\",IF(Liste!K151=\"\",\"\",K$4/Liste!K$5*Liste!K151))","v":""},{"$f":"IF(L$4=0,\"\",IF(Liste!L151=\"\",\"\",L$4/Liste!L$5*Liste!L151))","v":""},{"$f":"IF(M$4=0,\"\",IF(Liste!M151=\"\",\"\",M$4/Liste!M$5*Liste!M151))","v":""},{"$f":"IF(N$4=0,\"\",IF(Liste!N151=\"\",\"\",N$4/Liste!N$5*Liste!N151))","v":""},{"$f":"IF(O$4=0,\"\",IF(Liste!O151=\"\",\"\",O$4/Liste!O$5*Liste!O151))","v":""},{"$f":"IF(P$4=0,\"\",IF(Liste!P151=\"\",\"\",P$4/Liste!P$5*Liste!P151))","v":""},{"$f":"IF(Q$4=0,\"\",IF(Liste!Q151=\"\",\"\",Q$4/Liste!Q$5*Liste!Q151))","v":""}]
["",{"$f":"IF(Liste!B152=\"\",\"\",Liste!B152)","v":""},{"$f":"IF(Liste!C152=\"\",\"\",Liste!C152)","v":""},{"$f":"IF(Liste!D152=\"\",\"\",Liste!D152)","v":""},{"$f":"IF(E$4=0,\"\",IF(Liste!E152=\"\",\"\",E$4/Liste!E$5*Liste!E152))","v":""},{"$f":"IF(F$4=0,\"\",IF(Liste!F152=\"\",\"\",F$4/Liste!F$5*Liste!F152))","v":""},{"$f":"IF(G$4=0,\"\",IF(Liste!G152=\"\",\"\",G$4/Liste!G$5*Liste!G152))","v":""},{"$f":"IF(H$4=0,\"\",IF(Liste!H152=\"\",\"\",H$4/Liste!H$5*Liste!H152))","v":""},{"$f":"IF(I$4=0,\"\",IF(Liste!I152=\"\",\"\",I$4/Liste!I$5*Liste!I152))","v":""},{"$f":"IF(J$4=0,\"\",IF(Liste!J152=\"\",\"\",J$4/Liste!J$5*Liste!J152))","v":""},{"$f":"IF(K$4=0,\"\",IF(Liste!K152=\"\",\"\",K$4/Liste!K$5*Liste!K152))","v":""},{"$f":"IF(L$4=0,\"\",IF(Liste!L152=\"\",\"\",L$4/Liste!L$5*Liste!L152))","v":""},{"$f":"IF(M$4=0,\"\",IF(Liste!M152=\"\",\"\",M$4/Liste!M$5*Liste!M152))","v":""},{"$f":"IF(N$4=0,\"\",IF(Liste!N152=\"\",\"\",N$4/Liste!N$5*Liste!N152))","v":""},{"$f":"IF(O$4=0,\"\",IF(Liste!O152=\"\",\"\",O$4/Liste!O$5*Liste!O152))","v":""},{"$f":"IF(P$4=0,\"\",IF(Liste!P152=\"\",\"\",P$4/Liste!P$5*Liste!P152))","v":""},{"$f":"IF(Q$4=0,\"\",IF(Liste!Q152=\"\",\"\",Q$4/Liste!Q$5*Liste!Q152))","v":""}]
["",{"$f":"IF(Liste!B153=\"\",\"\",Liste!B153)","v":""},{"$f":"IF(Liste!C153=\"\",\"\",Liste!C153)","v":""},{"$f":"IF(Liste!D153=\"\",\"\",Liste!D153)","v":""},{"$f":"IF(E$4=0,\"\",IF(Liste!E153=\"\",\"\",E$4/Liste!E$5*Liste!E153))","v":""},{"$f":"IF(F$4=0,\"\",IF(Liste!F153=\"\",\"\",F$4/Liste!F$5*Liste!F153))","v":""},{"$f":"IF(G$4=0,\"\",IF(Liste!G153=\"\",\"\",G$4/Liste!G$5*Liste!G153))","v":""},{"$f":"IF(H$4=0,\"\",IF(Liste!H153=\"\",\"\",H$4/Liste!H$5*Liste!H153))","v":""},{"$f":"IF(I$4=0,\"\",IF(Liste!I153=\"\",\"\",I$4/Liste!I$5*Liste!I153))","v":""},{"$f":"IF(J$4=0,\"\",IF(Liste!J153=\"\",\"\",J$4/Liste!J$5*Liste!J153))","v":""},{"$f":"IF(K$4=0,\"\",IF(Liste!K153=\"\",\"\",K$4/Liste!K$5*Liste!K153))","v":""},{"$f":"IF(L$4=0,\"\",IF(Liste!L153=\"\",\"\",L$4/Liste!L$5*Liste!L153))","v":""},{"$f":"IF(M$4=0,\"\",IF(Liste!M153=\"\",\"\",M$4/Liste!M$5*Liste!M153))","v":""},{"$f":"IF(N$4=0,\"\",IF(Liste!N153=\"\",\"\",N$4/Liste!N$5*Liste!N153))","v":""},{"$f":"IF(O$4=0,\"\",IF(Liste!O153=\"\",\"\",O$4/Liste!O$5*Liste!O153))","v":""},{"$f":"IF(P$4=0,\"\",IF(Liste!P153=\"\",\"\",P$4/Liste!P$5*Liste!P153))","v":""},{"$f":"IF(Q$4=0,\"\",IF(Liste!Q153=\"\",\"\",Q$4/Liste!Q$5*Liste!Q153))","v":""}]
["",{"$f":"IF(Liste!B154=\"\",\"\",Liste!B154)","v":""},{"$f":"IF(Liste!C154=\"\",\"\",Liste!C154)","v":""},{"$f":"IF(Liste!D154=\"\",\"\",Liste!D154)","v":""},{"$f":"IF(E$4=0,\"\",IF(Liste!E154=\"\",\"\",E$4/Liste!E$5*Liste!E154))","v":""},{"$f":"IF(F$4=0,\"\",IF(Liste!F154=\"\",\"\",F$4/Liste!F$5*Liste!F154))","v":""},{"$f":"IF(G$4=0,\"\",IF(Liste!G154=\"\",\"\",G$4/Liste!G$5*Liste!G154))","v":""},{"$f":"IF(H$4=0,\"\",IF(Liste!H154=\"\",\"\",H$4/Liste!H$5*Liste!H154))","v":""},{"$f":"IF(I$4=0,\"\",IF(Liste!I154=\"\",\"\",I$4/Liste!I$5*Liste!I154))","v":""},{"$f":"IF(J$4=0,\"\",IF(Liste!J154=\"\",\"\",J$4/Liste!J$5*Liste!J154))","v":""},{"$f":"IF(K$4=0,\"\",IF(Liste!K154=\"\",\"\",K$4/Liste!K$5*Liste!K154))","v":""},{"$f":"IF(L$4=0,\"\",IF(Liste!L154=\"\",\"\",L$4/Liste!L$5*Liste!L154))","v":""},{"$f":"IF(M$4=0,\"\",IF(Liste!M154=\"\",\"\",M$4/Liste!M$5*Liste!M154))","v":""},{"$f":"IF(N$4=0,\"\",IF(Liste!N154=\"\",\"\",N$4/Liste!N$5*Liste!N154))","v":""},{"$f":"IF(O$4=0,\"\",IF(Liste!O154=\"\",\"\",O$4/Liste!O$5*Liste!O154))","v":""},{"$f":"IF(P$4=0,\"\",IF(Liste!P154=\"\",\"\",P$4/Liste!P$5*Liste!P154))","v":""},{"$f":"IF(Q$4=0,\"\",IF(Liste!Q154=\"\",\"\",Q$4/Liste!Q$5*Liste!Q154))","v":""}]
["",{"$f":"IF(Liste!B155=\"\",\"\",Liste!B155)","v":""},{"$f":"IF(Liste!C155=\"\",\"\",Liste!C155)","v":""},{"$f":"IF(Liste!D155=\"\",\"\",Liste!D155)","v":""},{"$f":"IF(E$4=0,\"\",IF(Liste!E155=\"\",\"\",E$4/Liste!E$5*Liste!E155))","v":""},{"$f":"IF(F$4=0,\"\",IF(Liste!F155=\"\",\"\",F$4/Liste!F$5*Liste!F155))","v":""},{"$f":"IF(G$4=0,\"\",IF(Liste!G155=\"\",\"\",G$4/Liste!G$5*Liste!G155))","v":""},{"$f":"IF(H$4=0,\"\",IF(Liste!H155=\"\",\"\",H$4/Liste!H$5*Liste!H155))","v":""},{"$f":"IF(I$4=0,\"\",IF(Liste!I155=\"\",\"\",I$4/Liste!I$5*Liste!I155))","v":""},{"$f":"IF(J$4=0,\"\",IF(Liste!J155=\"\",\"\",J$4/Liste!J$5*Liste!J155))","v":""},{"$f":"IF(K$4=0,\"\",IF(Liste!K155=\"\",\"\",K$4/Liste!K$5*Liste!K155))","v":""},{"$f":"IF(L$4=0,\"\",IF(Liste!L155=\"\",\"\",L$4/Liste!L$5*Liste!L155))","v":""},{"$f":"IF(M$4=0,\"\",IF(Liste!M155=\"\",\"\",M$4/Liste!M$5*Liste!M155))","v":""},{"$f":"IF(N$4=0,\"\",IF(Liste!N155=\"\",\"\",N$4/Liste!N$5*Liste!N155))","v":""},{"$f":"IF(O$4=0,\"\",IF(Liste!O155=\"\",\"\",O$4/Liste!O$5*Liste!O155))","v":""},{"$f":"IF(P$4=0,\"\",IF(Liste!P155=\"\",\"\",P$4/Liste!P$5*Liste!P155))","v":""},{"$f":"IF(Q$4=0,\"\",IF(Liste!Q155=\"\",\"\",Q$4/Liste!Q$5*Liste!Q155))","v":""}]
["",{"$f":"IF(Liste!B156=\"\",\"\",Liste!B156)","v":""},{"$f":"IF(Liste!C156=\"\",\"\",Liste!C156)","v":""},{"$f":"IF(Liste!D156=\"\",\"\",Liste!D156)","v":""},{"$f":"IF(E$4=0,\"\",IF(Liste!E156=\"\",\"\",E$4/Liste!E$5*Liste!E156))","v":""},{"$f":"IF(F$4=0,\"\",IF(Liste!F156=\"\",\"\",F$4/Liste!F$5*Liste!F156))","v":""},{"$f":"IF(G$4=0,\"\",IF(Liste!G156=\"\",\"\",G$4/Liste!G$5*Liste!G156))","v":""},{"$f":"IF(H$4=0,\"\",IF(Liste!H156=\"\",\"\",H$4/Liste!H$5*Liste!H156))","v":""},{"$f":"IF(I$4=0,\"\",IF(Liste!I156=\"\",\"\",I$4/Liste!I$5*Liste!I156))","v":""},{"$f":"IF(J$4=0,\"\",IF(Liste!J156=\"\",\"\",J$4/Liste!J$5*Liste!J156))","v":""},{"$f":"IF(K$4=0,\"\",IF(Liste!K156=\"\",\"\",K$4/Liste!K$5*Liste!K156))","v":""},{"$f":"IF(L$4=0,\"\",IF(Liste!L156=\"\",\"\",L$4/Liste!L$5*Liste!L156))","v":""},{"$f":"IF(M$4=0,\"\",IF(Liste!M156=\"\",\"\",M$4/Liste!M$5*Liste!M156))","v":""},{"$f":"IF(N$4=0,\"\",IF(Liste!N156=\"\",\"\",N$4/Liste!N$5*Liste!N156))","v":""},{"$f":"IF(O$4=0,\"\",IF(Liste!O156=\"\",\"\",O$4/Liste!O$5*Liste!O156))","v":""},{"$f":"IF(P$4=0,\"\",IF(Liste!P156=\"\",\"\",P$4/Liste!P$5*Liste!P156))","v":""},{"$f":"IF(Q$4=0,\"\",IF(Liste!Q156=\"\",\"\",Q$4/Liste!Q$5*Liste!Q156))","v":""}]
["",{"$f":"IF(Liste!B157=\"\",\"\",Liste!B157)","v":""},{"$f":"IF(Liste!C157=\"\",\"\",Liste!C157)","v":""},{"$f":"IF(Liste!D157=\"\",\"\",Liste!D157)","v":""},{"$f":"IF(E$4=0,\"\",IF(Liste!E157=\"\",\"\",E$4/Liste!E$5*Liste!E157))","v":""},{"$f":"IF(F$4=0,\"\",IF(Liste!F157=\"\",\"\",F$4/Liste!F$5*Liste!F157))","v":""},{"$f":"IF(G$4=0,\"\",IF(Liste!G157=\"\",\"\",G$4/Liste!G$5*Liste!G157))","v":""},{"$f":"IF(H$4=0,\"\",IF(Liste!H157=\"\",\"\",H$4/Liste!H$5*Liste!H157))","v":""},{"$f":"IF(I$4=0,\"\",IF(Liste!I157=\"\",\"\",I$4/Liste!I$5*Liste!I157))","v":""},{"$f":"IF(J$4=0,\"\",IF(Liste!J157=\"\",\"\",J$4/Liste!J$5*Liste!J157))","v":""},{"$f":"IF(K$4=0,\"\",IF(Liste!K157=\"\",\"\",K$4/Liste!K$5*Liste!K157))","v":""},{"$f":"IF(L$4=0,\"\",IF(Liste!L157=\"\",\"\",L$4/Liste!L$5*Liste!L157))","v":""},{"$f":"IF(M$4=0,\"\",IF(Liste!M157=\"\",\"\",M$4/Liste!M$5*Liste!M157))","v":""},{"$f":"IF(N$4=0,\"\",IF(Liste!N157=\"\",\"\",N$4/Liste!N$5*Liste!N157))","v":""},{"$f":"IF(O$4=0,\"\",IF(Liste!O157=\"\",\"\",O$4/Liste!O$5*Liste!O157))","v":""},{"$f":"IF(P$4=0,\"\",IF(Liste!P157=\"\",\"\",P$4/Liste!P$5*Liste!P157))","v":""},{"$f":"IF(Q$4=0,\"\",IF(Liste!Q157=\"\",\"\",Q$4/Liste!Q$5*Liste!Q157))","v":""}]
["",{"$f":"IF(Liste!B158=\"\",\"\",Liste!B158)","v":""},{"$f":"IF(Liste!C158=\"\",\"\",Liste!C158)","v":""},{"$f":"IF(Liste!D158=\"\",\"\",Liste!D158)","v":""},{"$f":"IF(E$4=0,\"\",IF(Liste!E158=\"\",\"\",E$4/Liste!E$5*Liste!E158))","v":""},{"$f":"IF(F$4=0,\"\",IF(Liste!F158=\"\",\"\",F$4/Liste!F$5*Liste!F158))","v":""},{"$f":"IF(G$4=0,\"\",IF(Liste!G158=\"\",\"\",G$4/Liste!G$5*Liste!G158))","v":""},{"$f":"IF(H$4=0,\"\",IF(Liste!H158=\"\",\"\",H$4/Liste!H$5*Liste!H158))","v":""},{"$f":"IF(I$4=0,\"\",IF(Liste!I158=\"\",\"\",I$4/Liste!I$5*Liste!I158))","v":""},{"$f":"IF(J$4=0,\"\",IF(Liste!J158=\"\",\"\",J$4/Liste!J$5*Liste!J158))","v":""},{"$f":"IF(K$4=0,\"\",IF(Liste!K158=\"\",\"\",K$4/Liste!K$5*Liste!K158))","v":""},{"$f":"IF(L$4=0,\"\",IF(Liste!L158=\"\",\"\",L$4/Liste!L$5*Liste!L158))","v":""},{"$f":"IF(M$4=0,\"\",IF(Liste!M158=\"\",\"\",M$4/Liste!M$5*Liste!M158))","v":""},{"$f":"IF(N$4=0,\"\",IF(Liste!N158=\"\",\"\",N$4/Liste!N$5*Liste!N158))","v":""},{"$f":"IF(O$4=0,\"\",IF(Liste!O158=\"\",\"\",O$4/Liste!O$5*Liste!O158))","v":""},{"$f":"IF(P$4=0,\"\",IF(Liste!P158=\"\",\"\",P$4/Liste!P$5*Liste!P158))","v":""},{"$f":"IF(Q$4=0,\"\",IF(Liste!Q158=\"\",\"\",Q$4/Liste!Q$5*Liste!Q158))","v":""}]
["",{"$f":"IF(Liste!B159=\"\",\"\",Liste!B159)","v":""},{"$f":"IF(Liste!C159=\"\",\"\",Liste!C159)","v":""},{"$f":"IF(Liste!D159=\"\",\"\",Liste!D159)","v":""},{"$f":"IF(E$4=0,\"\",IF(Liste!E159=\"\",\"\",E$4/Liste!E$5*Liste!E159))","v":""},{"$f":"IF(F$4=0,\"\",IF(Liste!F159=\"\",\"\",F$4/Liste!F$5*Liste!F159))","v":""},{"$f":"IF(G$4=0,\"\",IF(Liste!G159=\"\",\"\",G$4/Liste!G$5*Liste!G159))","v":""},{"$f":"IF(H$4=0,\"\",IF(Liste!H159=\"\",\"\",H$4/Liste!H$5*Liste!H159))","v":""},{"$f":"IF(I$4=0,\"\",IF(Liste!I159=\"\",\"\",I$4/Liste!I$5*Liste!I159))","v":""},{"$f":"IF(J$4=0,\"\",IF(Liste!J159=\"\",\"\",J$4/Liste!J$5*Liste!J159))","v":""},{"$f":"IF(K$4=0,\"\",IF(Liste!K159=\"\",\"\",K$4/Liste!K$5*Liste!K159))","v":""},{"$f":"IF(L$4=0,\"\",IF(Liste!L159=\"\",\"\",L$4/Liste!L$5*Liste!L159))","v":""},{"$f":"IF(M$4=0,\"\",IF(Liste!M159=\"\",\"\",M$4/Liste!M$5*Liste!M159))","v":""},{"$f":"IF(N$4=0,\"\",IF(Liste!N159=\"\",\"\",N$4/Liste!N$5*Liste!N159))","v":""},{"$f":"IF(O$4=0,\"\",IF(Liste!O159=\"\",\"\",O$4/Liste!O$5*Liste!O159))","v":""},{"$f":"IF(P$4=0,\"\",IF(Liste!P159=\"\",\"\",P$4/Liste!P$5*Liste!P159))","v":""},{"$f":"IF(Q$4=0,\"\",IF(Liste!Q159=\"\",\"\",Q$4/Liste!Q$5*Liste!Q159))","v":""}]
["",{"$f":"IF(Liste!B160=\"\",\"\",Liste!B160)","v":""},{"$f":"IF(Liste!C160=\"\",\"\",Liste!C160)","v":""},{"$f":"IF(Liste!D160=\"\",\"\",Liste!D160)","v":""},{"$f":"IF(E$4=0,\"\",IF(Liste!E160=\"\",\"\",E$4/Liste!E$5*Liste!E160))","v":""},{"$f":"IF(F$4=0,\"\",IF(Liste!F160=\"\",\"\",F$4/Liste!F$5*Liste!F160))","v":""},{"$f":"IF(G$4=0,\"\",IF(Liste!G160=\"\",\"\",G$4/Liste!G$5*Liste!G160))","v":""},{"$f":"IF(H$4=0,\"\",IF(Liste!H160=\"\",\"\",H$4/Liste!H$5*Liste!H160))","v":""},{"$f":"IF(I$4=0,\"\",IF(Liste!I160=\"\",\"\",I$4/Liste!I$5*Liste!I160))","v":""},{"$f":"IF(J$4=0,\"\",IF(Liste!J160=\"\",\"\",J$4/Liste!J$5*Liste!J160))","v":""},{"$f":"IF(K$4=0,\"\",IF(Liste!K160=\"\",\"\",K$4/Liste!K$5*Liste!K160))","v":""},{"$f":"IF(L$4=0,\"\",IF(Liste!L160=\"\",\"\",L$4/Liste!L$5*Liste!L160))","v":""},{"$f":"IF(M$4=0,\"\",IF(Liste!M160=\"\",\"\",M$4/Liste!M$5*Liste!M160))","v":""},{"$f":"IF(N$4=0,\"\",IF(Liste!N160=\"\",\"\",N$4/Liste!N$5*Liste!N160))","v":""},{"$f":"IF(O$4=0,\"\",IF(Liste!O160=\"\",\"\",O$4/Liste!O$5*Liste!O160))","v":""},{"$f":"IF(P$4=0,\"\",IF(Liste!P160=\"\",\"\",P$4/Liste!P$5*Liste!P160))","v":""},{"$f":"IF(Q$4=0,\"\",IF(Liste!Q160=\"\",\"\",Q$4/Liste!Q$5*Liste!Q160))","v":""}]
["",{"$f":"IF(Liste!B161=\"\",\"\",Liste!B161)","v":""},{"$f":"IF(Liste!C161=\"\",\"\",Liste!C161)","v":""},{"$f":"IF(Liste!D161=\"\",\"\",Liste!D161)","v":""},{"$f":"IF(E$4=0,\"\",IF(Liste!E161=\"\",\"\",E$4/Liste!E$5*Liste!E161))","v":""},{"$f":"IF(F$4=0,\"\",IF(Liste!F161=\"\",\"\",F$4/Liste!F$5*Liste!F161))","v":""},{"$f":"IF(G$4=0,\"\",IF(Liste!G161=\"\",\"\",G$4/Liste!G$5*Liste!G161))","v":""},{"$f":"IF(H$4=0,\"\",IF(Liste!H161=\"\",\"\",H$4/Liste!H$5*Liste!H161))","v":""},{"$f":"IF(I$4=0,\"\",IF(Liste!I161=\"\",\"\",I$4/Liste!I$5*Liste!I161))","v":""},{"$f":"IF(J$4=0,\"\",IF(Liste!J161=\"\",\"\",J$4/Liste!J$5*Liste!J161))","v":""},{"$f":"IF(K$4=0,\"\",IF(Liste!K161=\"\",\"\",K$4/Liste!K$5*Liste!K161))","v":""},{"$f":"IF(L$4=0,\"\",IF(Liste!L161=\"\",\"\",L$4/Liste!L$5*Liste!L161))","v":""},{"$f":"IF(M$4=0,\"\",IF(Liste!M161=\"\",\"\",M$4/Liste!M$5*Liste!M161))","v":""},{"$f":"IF(N$4=0,\"\",IF(Liste!N161=\"\",\"\",N$4/Liste!N$5*Liste!N161))","v":""},{"$f":"IF(O$4=0,\"\",IF(Liste!O161=\"\",\"\",O$4/Liste!O$5*Liste!O161))","v":""},{"$f":"IF(P$4=0,\"\",IF(Liste!P161=\"\",\"\",P$4/Liste!P$5*Liste!P161))","v":""},{"$f":"IF(Q$4=0,\"\",IF(Liste!Q161=\"\",\"\",Q$4/Liste!Q$5*Liste!Q161))","v":""}]
["",{"$f":"IF(Liste!B162=\"\",\"\",Liste!B162)","v":""},{"$f":"IF(Liste!C162=\"\",\"\",Liste!C162)","v":""},{"$f":"IF(Liste!D162=\"\",\"\",Liste!D162)","v":""},{"$f":"IF(E$4=0,\"\",IF(Liste!E162=\"\",\"\",E$4/Liste!E$5*Liste!E162))","v":""},{"$f":"IF(F$4=0,\"\",IF(Liste!F162=\"\",\"\",F$4/Liste!F$5*Liste!F162))","v":""},{"$f":"IF(G$4=0,\"\",IF(Liste!G162=\"\",\"\",G$4/Liste!G$5*Liste!G162))","v":""},{"$f":"IF(H$4=0,\"\",IF(Liste!H162=\"\",\"\",H$4/Liste!H$5*Liste!H162))","v":""},{"$f":"IF(I$4=0,\"\",IF(Liste!I162=\"\",\"\",I$4/Liste!I$5*Liste!I162))","v":""},{"$f":"IF(J$4=0,\"\",IF(Liste!J162=\"\",\"\",J$4/Liste!J$5*Liste!J162))","v":""},{"$f":"IF(K$4=0,\"\",IF(Liste!K162=\"\",\"\",K$4/Liste!K$5*Liste!K162))","v":""},{"$f":"IF(L$4=0,\"\",IF(Liste!L162=\"\",\"\",L$4/Liste!L$5*Liste!L162))","v":""},{"$f":"IF(M$4=0,\"\",IF(Liste!M162=\"\",\"\",M$4/Liste!M$5*Liste!M162))","v":""},{"$f":"IF(N$4=0,\"\",IF(Liste!N162=\"\",\"\",N$4/Liste!N$5*Liste!N162))","v":""},{"$f":"IF(O$4=0,\"\",IF(Liste!O162=\"\",\"\",O$4/Liste!O$5*Liste!O162))","v":""},{"$f":"IF(P$4=0,\"\",IF(Liste!P162=\"\",\"\",P$4/Liste!P$5*Liste!P162))","v":""},{"$f":"IF(Q$4=0,\"\",IF(Liste!Q162=\"\",\"\",Q$4/Liste!Q$5*Liste!Q162))","v":""}]
["",{"$f":"IF(Liste!B163=\"\",\"\",Liste!B163)","v":""},{"$f":"IF(Liste!C163=\"\",\"\",Liste!C163)","v":""},{"$f":"IF(Liste!D163=\"\",\"\",Liste!D163)","v":""},{"$f":"IF(E$4=0,\"\",IF(Liste!E163=\"\",\"\",E$4/Liste!E$5*Liste!E163))","v":""},{"$f":"IF(F$4=0,\"\",IF(Liste!F163=\"\",\"\",F$4/Liste!F$5*Liste!F163))","v":""},{"$f":"IF(G$4=0,\"\",IF(Liste!G163=\"\",\"\",G$4/Liste!G$5*Liste!G163))","v":""},{"$f":"IF(H$4=0,\"\",IF(Liste!H163=\"\",\"\",H$4/Liste!H$5*Liste!H163))","v":""},{"$f":"IF(I$4=0,\"\",IF(Liste!I163=\"\",\"\",I$4/Liste!I$5*Liste!I163))","v":""},{"$f":"IF(J$4=0,\"\",IF(Liste!J163=\"\",\"\",J$4/Liste!J$5*Liste!J163))","v":""},{"$f":"IF(K$4=0,\"\",IF(Liste!K163=\"\",\"\",K$4/Liste!K$5*Liste!K163))","v":""},{"$f":"IF(L$4=0,\"\",IF(Liste!L163=\"\",\"\",L$4/Liste!L$5*Liste!L163))","v":""},{"$f":"IF(M$4=0,\"\",IF(Liste!M163=\"\",\"\",M$4/Liste!M$5*Liste!M163))","v":""},{"$f":"IF(N$4=0,\"\",IF(Liste!N163=\"\",\"\",N$4/Liste!N$5*Liste!N163))","v":""},{"$f":"IF(O$4=0,\"\",IF(Liste!O163=\"\",\"\",O$4/Liste!O$5*Liste!O163))","v":""},{"$f":"IF(P$4=0,\"\",IF(Liste!P163=\"\",\"\",P$4/Liste!P$5*Liste!P163))","v":""},{"$f":"IF(Q$4=0,\"\",IF(Liste!Q163=\"\",\"\",Q$4/Liste!Q$5*Liste!Q163))","v":""}]
["",{"$f":"IF(Liste!B164=\"\",\"\",Liste!B164)","v":""},{"$f":"IF(Liste!C164=\"\",\"\",Liste!C164)","v":""},{"$f":"IF(Liste!D164=\"\",\"\",Liste!D164)","v":""},{"$f":"IF(E$4=0,\"\",IF(Liste!E164=\"\",\"\",E$4/Liste!E$5*Liste!E164))","v":""},{"$f":"IF(F$4=0,\"\",IF(Liste!F164=\"\",\"\",F$4/Liste!F$5*Liste!F164))","v":""},{"$f":"IF(G$4=0,\"\",IF(Liste!G164=\"\",\"\",G$4/Liste!G$5*Liste!G164))","v":""},{"$f":"IF(H$4=0,\"\",IF(Liste!H164=\"\",\"\",H$4/Liste!H$5*Liste!H164))","v":""},{"$f":"IF(I$4=0,\"\",IF(Liste!I164=\"\",\"\",I$4/Liste!I$5*Liste!I164))","v":""},{"$f":"IF(J$4=0,\"\",IF(Liste!J164=\"\",\"\",J$4/Liste!J$5*Liste!J164))","v":""},{"$f":"IF(K$4=0,\"\",IF(Liste!K164=\"\",\"\",K$4/Liste!K$5*Liste!K164))","v":""},{"$f":"IF(L$4=0,\"\",IF(Liste!L164=\"\",\"\",L$4/Liste!L$5*Liste!L164))","v":""},{"$f":"IF(M$4=0,\"\",IF(Liste!M164=\"\",\"\",M$4/Liste!M$5*Liste!M164))","v":""},{"$f":"IF(N$4=0,\"\",IF(Liste!N164=\"\",\"\",N$4/Liste!N$5*Liste!N164))","v":""},{"$f":"IF(O$4=0,\"\",IF(Liste!O164=\"\",\"\",O$4/Liste!O$5*Liste!O164))","v":""},{"$f":"IF(P$4=0,\"\",IF(Liste!P164=\"\",\"\",P$4/Liste!P$5*Liste!P164))","v":""},{"$f":"IF(Q$4=0,\"\",IF(Liste!Q164=\"\",\"\",Q$4/Liste!Q$5*Liste!Q164))","v":""}]
["",{"$f":"IF(Liste!B165=\"\",\"\",Liste!B165)","v":""},{"$f":"IF(Liste!C165=\"\",\"\",Liste!C165)","v":""},{"$f":"IF(Liste!D165=\"\",\"\",Liste!D165)","v":""},{"$f":"IF(E$4=0,\"\",IF(Liste!E165=\"\",\"\",E$4/Liste!E$5*Liste!E165))","v":""},{"$f":"IF(F$4=0,\"\",IF(Liste!F165=\"\",\"\",F$4/Liste!F$5*Liste!F165))","v":""},{"$f":"IF(G$4=0,\"\",IF(Liste!G165=\"\",\"\",G$4/Liste!G$5*Liste!G165))","v":""},{"$f":"IF(H$4=0,\"\",IF(Liste!H165=\"\",\"\",H$4/Liste!H$5*Liste!H165))","v":""},{"$f":"IF(I$4=0,\"\",IF(Liste!I165=\"\",\"\",I$4/Liste!I$5*Liste!I165))","v":""},{"$f":"IF(J$4=0,\"\",IF(Liste!J165=\"\",\"\",J$4/Liste!J$5*Liste!J165))","v":""},{"$f":"IF(K$4=0,\"\",IF(Liste!K165=\"\",\"\",K$4/Liste!K$5*Liste!K165))","v":""},{"$f":"IF(L$4=0,\"\",IF(Liste!L165=\"\",\"\",L$4/Liste!L$5*Liste!L165))","v":""},{"$f":"IF(M$4=0,\"\",IF(Liste!M165=\"\",\"\",M$4/Liste!M$5*Liste!M165))","v":""},{"$f":"IF(N$4=0,\"\",IF(Liste!N165=\"\",\"\",N$4/Liste!N$5*Liste!N165))","v":""},{"$f":"IF(O$4=0,\"\",IF(Liste!O165=\"\",\"\",O$4/Liste!O$5*Liste!O165))","v":""},{"$f":"IF(P$4=0,\"\",IF(Liste!P165=\"\",\"\",P$4/Liste!P$5*Liste!P165))","v":""},{"$f":"IF(Q$4=0,\"\",IF(Liste!Q165=\"\",\"\",Q$4/Liste!Q$5*Liste!Q165))","v":""}]
["",{"$f":"IF(Liste!B166=\"\",\"\",Liste!B166)","v":""},{"$f":"IF(Liste!C166=\"\",\"\",Liste!C166)","v":""},{"$f":"IF(Liste!D166=\"\",\"\",Liste!D166)","v":""},{"$f":"IF(E$4=0,\"\",IF(Liste!E166=\"\",\"\",E$4/Liste!E$5*Liste!E166))","v":""},{"$f":"IF(F$4=0,\"\",IF(Liste!F166=\"\",\"\",F$4/Liste!F$5*Liste!F166))","v":""},{"$f":"IF(G$4=0,\"\",IF(Liste!G166=\"\",\"\",G$4/Liste!G$5*Liste!G166))","v":""},{"$f":"IF(H$4=0,\"\",IF(Liste!H166=\"\",\"\",H$4/Liste!H$5*Liste!H166))","v":""},{"$f":"IF(I$4=0,\"\",IF(Liste!I166=\"\",\"\",I$4/Liste!I$5*Liste!I166))","v":""},{"$f":"IF(J$4=0,\"\",IF(Liste!J166=\"\",\"\",J$4/Liste!J$5*Liste!J166))","v":""},{"$f":"IF(K$4=0,\"\",IF(Liste!K166=\"\",\"\",K$4/Liste!K$5*Liste!K166))","v":""},{"$f":"IF(L$4=0,\"\",IF(Liste!L166=\"\",\"\",L$4/Liste!L$5*Liste!L166))","v":""},{"$f":"IF(M$4=0,\"\",IF(Liste!M166=\"\",\"\",M$4/Liste!M$5*Liste!M166))","v":""},{"$f":"IF(N$4=0,\"\",IF(Liste!N166=\"\",\"\",N$4/Liste!N$5*Liste!N166))","v":""},{"$f":"IF(O$4=0,\"\",IF(Liste!O166=\"\",\"\",O$4/Liste!O$5*Liste!O166))","v":""},{"$f":"IF(P$4=0,\"\",IF(Liste!P166=\"\",\"\",P$4/Liste!P$5*Liste!P166))","v":""},{"$f":"IF(Q$4=0,\"\",IF(Liste!Q166=\"\",\"\",Q$4/Liste!Q$5*Liste!Q166))","v":""}]
["",{"$f":"IF(Liste!B167=\"\",\"\",Liste!B167)","v":""},{"$f":"IF(Liste!C167=\"\",\"\",Liste!C167)","v":""},{"$f":"IF(Liste!D167=\"\",\"\",Liste!D167)","v":""},{"$f":"IF(E$4=0,\"\",IF(Liste!E167=\"\",\"\",E$4/Liste!E$5*Liste!E167))","v":""},{"$f":"IF(F$4=0,\"\",IF(Liste!F167=\"\",\"\",F$4/Liste!F$5*Liste!F167))","v":""},{"$f":"IF(G$4=0,\"\",IF(Liste!G167=\"\",\"\",G$4/Liste!G$5*Liste!G167))","v":""},{"$f":"IF(H$4=0,\"\",IF(Liste!H167=\"\",\"\",H$4/Liste!H$5*Liste!H167))","v":""},{"$f":"IF(I$4=0,\"\",IF(Liste!I167=\"\",\"\",I$4/Liste!I$5*Liste!I167))","v":""},{"$f":"IF(J$4=0,\"\",IF(Liste!J167=\"\",\"\",J$4/Liste!J$5*Liste!J167))","v":""},{"$f":"IF(K$4=0,\"\",IF(Liste!K167=\"\",\"\",K$4/Liste!K$5*Liste!K167))","v":""},{"$f":"IF(L$4=0,\"\",IF(Liste!L167=\"\",\"\",L$4/Liste!L$5*Liste!L167))","v":""},{"$f":"IF(M$4=0,\"\",IF(Liste!M167=\"\",\"\",M$4/Liste!M$5*Liste!M167))","v":""},{"$f":"IF(N$4=0,\"\",IF(Liste!N167=\"\",\"\",N$4/Liste!N$5*Liste!N167))","v":""},{"$f":"IF(O$4=0,\"\",IF(Liste!O167=\"\",\"\",O$4/Liste!O$5*Liste!O167))","v":""},{"$f":"IF(P$4=0,\"\",IF(Liste!P167=\"\",\"\",P$4/Liste!P$5*Liste!P167))","v":""},{"$f":"IF(Q$4=0,\"\",IF(Liste!Q167=\"\",\"\",Q$4/Liste!Q$5*Liste!Q167))","v":""}]
["",{"$f":"IF(Liste!B168=\"\",\"\",Liste!B168)","v":""},{"$f":"IF(Liste!C168=\"\",\"\",Liste!C168)","v":""},{"$f":"IF(Liste!D168=\"\",\"\",Liste!D168)","v":""},{"$f":"IF(E$4=0,\"\",IF(Liste!E168=\"\",\"\",E$4/Liste!E$5*Liste!E168))","v":""},{"$f":"IF(F$4=0,\"\",IF(Liste!F168=\"\",\"\",F$4/Liste!F$5*Liste!F168))","v":""},{"$f":"IF(G$4=0,\"\",IF(Liste!G168=\"\",\"\",G$4/Liste!G$5*Liste!G168))","v":""},{"$f":"IF(H$4=0,\"\",IF(Liste!H168=\"\",\"\",H$4/Liste!H$5*Liste!H168))","v":""},{"$f":"IF(I$4=0,\"\",IF(Liste!I168=\"\",\"\",I$4/Liste!I$5*Liste!I168))","v":""},{"$f":"IF(J$4=0,\"\",IF(Liste!J168=\"\",\"\",J$4/Liste!J$5*Liste!J168))","v":""},{"$f":"IF(K$4=0,\"\",IF(Liste!K168=\"\",\"\",K$4/Liste!K$5*Liste!K168))","v":""},{"$f":"IF(L$4=0,\"\",IF(Liste!L168=\"\",\"\",L$4/Liste!L$5*Liste!L168))","v":""},{"$f":"IF(M$4=0,\"\",IF(Liste!M168=\"\",\"\",M$4/Liste!M$5*Liste!M168))","v":""},{"$f":"IF(N$4=0,\"\",IF(Liste!N168=\"\",\"\",N$4/Liste!N$5*Liste!N168))","v":""},{"$f":"IF(O$4=0,\"\",IF(Liste!O168=\"\",\"\",O$4/Liste!O$5*Liste!O168))","v":""},{"$f":"IF(P$4=0,\"\",IF(Liste!P168=\"\",\"\",P$4/Liste!P$5*Liste!P168))","v":""},{"$f":"IF(Q$4=0,\"\",IF(Liste!Q168=\"\",\"\",Q$4/Liste!Q$5*Liste!Q168))","v":""}]
["",{"$f":"IF(Liste!B169=\"\",\"\",Liste!B169)","v":""},{"$f":"IF(Liste!C169=\"\",\"\",Liste!C169)","v":""},{"$f":"IF(Liste!D169=\"\",\"\",Liste!D169)","v":""},{"$f":"IF(E$4=0,\"\",IF(Liste!E169=\"\",\"\",E$4/Liste!E$5*Liste!E169))","v":""},{"$f":"IF(F$4=0,\"\",IF(Liste!F169=\"\",\"\",F$4/Liste!F$5*Liste!F169))","v":""},{"$f":"IF(G$4=0,\"\",IF(Liste!G169=\"\",\"\",G$4/Liste!G$5*Liste!G169))","v":""},{"$f":"IF(H$4=0,\"\",IF(Liste!H169=\"\",\"\",H$4/Liste!H$5*Liste!H169))","v":""},{"$f":"IF(I$4=0,\"\",IF(Liste!I169=\"\",\"\",I$4/Liste!I$5*Liste!I169))","v":""},{"$f":"IF(J$4=0,\"\",IF(Liste!J169=\"\",\"\",J$4/Liste!J$5*Liste!J169))","v":""},{"$f":"IF(K$4=0,\"\",IF(Liste!K169=\"\",\"\",K$4/Liste!K$5*Liste!K169))","v":""},{"$f":"IF(L$4=0,\"\",IF(Liste!L169=\"\",\"\",L$4/Liste!L$5*Liste!L169))","v":""},{"$f":"IF(M$4=0,\"\",IF(Liste!M169=\"\",\"\",M$4/Liste!M$5*Liste!M169))","v":""},{"$f":"IF(N$4=0,\"\",IF(Liste!N169=\"\",\"\",N$4/Liste!N$5*Liste!N169))","v":""},{"$f":"IF(O$4=0,\"\",IF(Liste!O169=\"\",\"\",O$4/Liste!O$5*Liste!O169))","v":""},{"$f":"IF(P$4=0,\"\",IF(Liste!P169=\"\",\"\",P$4/Liste!P$5*Liste!P169))","v":""},{"$f":"IF(Q$4=0,\"\",IF(Liste!Q169=\"\",\"\",Q$4/Liste!Q$5*Liste!Q169))","v":""}]
["",{"$f":"IF(Liste!B170=\"\",\"\",Liste!B170)","v":""},{"$f":"IF(Liste!C170=\"\",\"\",Liste!C170)","v":""},{"$f":"IF(Liste!D170=\"\",\"\",Liste!D170)","v":""},{"$f":"IF(E$4=0,\"\",IF(Liste!E170=\"\",\"\",E$4/Liste!E$5*Liste!E170))","v":""},{"$f":"IF(F$4=0,\"\",IF(Liste!F170=\"\",\"\",F$4/Liste!F$5*Liste!F170))","v":""},{"$f":"IF(G$4=0,\"\",IF(Liste!G170=\"\",\"\",G$4/Liste!G$5*Liste!G170))","v":""},{"$f":"IF(H$4=0,\"\",IF(Liste!H170=\"\",\"\",H$4/Liste!H$5*Liste!H170))","v":""},{"$f":"IF(I$4=0,\"\",IF(Liste!I170=\"\",\"\",I$4/Liste!I$5*Liste!I170))","v":""},{"$f":"IF(J$4=0,\"\",IF(Liste!J170=\"\",\"\",J$4/Liste!J$5*Liste!J170))","v":""},{"$f":"IF(K$4=0,\"\",IF(Liste!K170=\"\",\"\",K$4/Liste!K$5*Liste!K170))","v":""},{"$f":"IF(L$4=0,\"\",IF(Liste!L170=\"\",\"\",L$4/Liste!L$5*Liste!L170))","v":""},{"$f":"IF(M$4=0,\"\",IF(Liste!M170=\"\",\"\",M$4/Liste!M$5*Liste!M170))","v":""},{"$f":"IF(N$4=0,\"\",IF(Liste!N170=\"\",\"\",N$4/Liste!N$5*Liste!N170))","v":""},{"$f":"IF(O$4=0,\"\",IF(Liste!O170=\"\",\"\",O$4/Liste!O$5*Liste!O170))","v":""},{"$f":"IF(P$4=0,\"\",IF(Liste!P170=\"\",\"\",P$4/Liste!P$5*Liste!P170))","v":""},{"$f":"IF(Q$4=0,\"\",IF(Liste!Q170=\"\",\"\",Q$4/Liste!Q$5*Liste!Q170))","v":""}]
["",{"$f":"IF(Liste!B171=\"\",\"\",Liste!B171)","v":""},{"$f":"IF(Liste!C171=\"\",\"\",Liste!C171)","v":""},{"$f":"IF(Liste!D171=\"\",\"\",Liste!D171)","v":""},{"$f":"IF(E$4=0,\"\",IF(Liste!E171=\"\",\"\",E$4/Liste!E$5*Liste!E171))","v":""},{"$f":"IF(F$4=0,\"\",IF(Liste!F171=\"\",\"\",F$4/Liste!F$5*Liste!F171))","v":""},{"$f":"IF(G$4=0,\"\",IF(Liste!G171=\"\",\"\",G$4/Liste!G$5*Liste!G171))","v":""},{"$f":"IF(H$4=0,\"\",IF(Liste!H171=\"\",\"\",H$4/Liste!H$5*Liste!H171))","v":""},{"$f":"IF(I$4=0,\"\",IF(Liste!I171=\"\",\"\",I$4/Liste!I$5*Liste!I171))","v":""},{"$f":"IF(J$4=0,\"\",IF(Liste!J171=\"\",\"\",J$4/Liste!J$5*Liste!J171))","v":""},{"$f":"IF(K$4=0,\"\",IF(Liste!K171=\"\",\"\",K$4/Liste!K$5*Liste!K171))","v":""},{"$f":"IF(L$4=0,\"\",IF(Liste!L171=\"\",\"\",L$4/Liste!L$5*Liste!L171))","v":""},{"$f":"IF(M$4=0,\"\",IF(Liste!M171=\"\",\"\",M$4/Liste!M$5*Liste!M171))","v":""},{"$f":"IF(N$4=0,\"\",IF(Liste!N171=\"\",\"\",N$4/Liste!N$5*Liste!N171))","v":""},{"$f":"IF(O$4=0,\"\",IF(Liste!O171=\"\",\"\",O$4/Liste!O$5*Liste!O171))","v":""},{"$f":"IF(P$4=0,\"\",IF(Liste!P171=\"\",\"\",P$4/Liste!P$5*Liste!P171))","v":""},{"$f":"IF(Q$4=0,\"\",IF(Liste!Q171=\"\",\"\",Q$4/Liste!Q$5*Liste!Q171))","v":""}]
["",{"$f":"IF(Liste!B172=\"\",\"\",Liste!B172)","v":""},{"$f":"IF(Liste!C172=\"\",\"\",Liste!C172)","v":""},{"$f":"IF(Liste!D172=\"\",\"\",Liste!D172)","v":""},{"$f":"IF(E$4=0,\"\",IF(Liste!E172=\"\",\"\",E$4/Liste!E$5*Liste!E172))","v":""},{"$f":"IF(F$4=0,\"\",IF(Liste!F172=\"\",\"\",F$4/Liste!F$5*Liste!F172))","v":""},{"$f":"IF(G$4=0,\"\",IF(Liste!G172=\"\",\"\",G$4/Liste!G$5*Liste!G172))","v":""},{"$f":"IF(H$4=0,\"\",IF(Liste!H172=\"\",\"\",H$4/Liste!H$5*Liste!H172))","v":""},{"$f":"IF(I$4=0,\"\",IF(Liste!I172=\"\",\"\",I$4/Liste!I$5*Liste!I172))","v":""},{"$f":"IF(J$4=0,\"\",IF(Liste!J172=\"\",\"\",J$4/Liste!J$5*Liste!J172))","v":""},{"$f":"IF(K$4=0,\"\",IF(Liste!K172=\"\",\"\",K$4/Liste!K$5*Liste!K172))","v":""},{"$f":"IF(L$4=0,\"\",IF(Liste!L172=\"\",\"\",L$4/Liste!L$5*Liste!L172))","v":""},{"$f":"IF(M$4=0,\"\",IF(Liste!M172=\"\",\"\",M$4/Liste!M$5*Liste!M172))","v":""},{"$f":"IF(N$4=0,\"\",IF(Liste!N172=\"\",\"\",N$4/Liste!N$5*Liste!N172))","v":""},{"$f":"IF(O$4=0,\"\",IF(Liste!O172=\"\",\"\",O$4/Liste!O$5*Liste!O172))","v":""},{"$f":"IF(P$4=0,\"\",IF(Liste!P172=\"\",\"\",P$4/Liste!P$5*Liste!P172))","v":""},{"$f":"IF(Q$4=0,\"\",IF(Liste!Q172=\"\",\"\",Q$4/Liste!Q$5*Liste!Q172))","v":""}]
["",{"$f":"IF(Liste!B173=\"\",\"\",Liste!B173)","v":""},{"$f":"IF(Liste!C173=\"\",\"\",Liste!C173)","v":""},{"$f":"IF(Liste!D173=\"\",\"\",Liste!D173)","v":""},{"$f":"IF(E$4=0,\"\",IF(Liste!E173=\"\",\"\",E$4/Liste!E$5*Liste!E173))","v":""},{"$f":"IF(F$4=0,\"\",IF(Liste!F173=\"\",\"\",F$4/Liste!F$5*Liste!F173))","v":""},{"$f":"IF(G$4=0,\"\",IF(Liste!G173=\"\",\"\",G$4/Liste!G$5*Liste!G173))","v":""},{"$f":"IF(H$4=0,\"\",IF(Liste!H173=\"\",\"\",H$4/Liste!H$5*Liste!H173))","v":""},{"$f":"IF(I$4=0,\"\",IF(Liste!I173=\"\",\"\",I$4/Liste!I$5*Liste!I173))","v":""},{"$f":"IF(J$4=0,\"\",IF(Liste!J173=\"\",\"\",J$4/Liste!J$5*Liste!J173))","v":""},{"$f":"IF(K$4=0,\"\",IF(Liste!K173=\"\",\"\",K$4/Liste!K$5*Liste!K173))","v":""},{"$f":"IF(L$4=0,\"\",IF(Liste!L173=\"\",\"\",L$4/Liste!L$5*Liste!L173))","v":""},{"$f":"IF(M$4=0,\"\",IF(Liste!M173=\"\",\"\",M$4/Liste!M$5*Liste!M173))","v":""},{"$f":"IF(N$4=0,\"\",IF(Liste!N173=\"\",\"\",N$4/Liste!N$5*Liste!N173))","v":""},{"$f":"IF(O$4=0,\"\",IF(Liste!O173=\"\",\"\",O$4/Liste!O$5*Liste!O173))","v":""},{"$f":"IF(P$4=0,\"\",IF(Liste!P173=\"\",\"\",P$4/Liste!P$5*Liste!P173))","v":""},{"$f":"IF(Q$4=0,\"\",IF(Liste!Q173=\"\",\"\",Q$4/Liste!Q$5*Liste!Q173))","v":""}]
["",{"$f":"IF(Liste!B174=\"\",\"\",Liste!B174)","v":""},{"$f":"IF(Liste!C174=\"\",\"\",Liste!C174)","v":""},{"$f":"IF(Liste!D174=\"\",\"\",Liste!D174)","v":""},{"$f":"IF(E$4=0,\"\",IF(Liste!E174=\"\",\"\",E$4/Liste!E$5*Liste!E174))","v":""},{"$f":"IF(F$4=0,\"\",IF(Liste!F174=\"\",\"\",F$4/Liste!F$5*Liste!F174))","v":""},{"$f":"IF(G$4=0,\"\",IF(Liste!G174=\"\",\"\",G$4/Liste!G$5*Liste!G174))","v":""},{"$f":"IF(H$4=0,\"\",IF(Liste!H174=\"\",\"\",H$4/Liste!H$5*Liste!H174))","v":""},{"$f":"IF(I$4=0,\"\",IF(Liste!I174=\"\",\"\",I$4/Liste!I$5*Liste!I174))","v":""},{"$f":"IF(J$4=0,\"\",IF(Liste!J174=\"\",\"\",J$4/Liste!J$5*Liste!J174))","v":""},{"$f":"IF(K$4=0,\"\",IF(Liste!K174=\"\",\"\",K$4/Liste!K$5*Liste!K174))","v":""},{"$f":"IF(L$4=0,\"\",IF(Liste!L174=\"\",\"\",L$4/Liste!L$5*Liste!L174))","v":""},{"$f":"IF(M$4=0,\"\",IF(Liste!M174=\"\",\"\",M$4/Liste!M$5*Liste!M174))","v":""},{"$f":"IF(N$4=0,\"\",IF(Liste!N174=\"\",\"\",N$4/Liste!N$5*Liste!N174))","v":""},{"$f":"IF(O$4=0,\"\",IF(Liste!O174=\"\",\"\",O$4/Liste!O$5*Liste!O174))","v":""},{"$f":"IF(P$4=0,\"\",IF(Liste!P174=\"\",\"\",P$4/Liste!P$5*Liste!P174))","v":""},{"$f":"IF(Q$4=0,\"\",IF(Liste!Q174=\"\",\"\",Q$4/Liste!Q$5*Liste!Q174))","v":""}]
["",{"$f":"IF(Liste!B175=\"\",\"\",Liste!B175)","v":""},{"$f":"IF(Liste!C175=\"\",\"\",Liste!C175)","v":""},{"$f":"IF(Liste!D175=\"\",\"\",Liste!D175)","v":""},{"$f":"IF(E$4=0,\"\",IF(Liste!E175=\"\",\"\",E$4/Liste!E$5*Liste!E175))","v":""},{"$f":"IF(F$4=0,\"\",IF(Liste!F175=\"\",\"\",F$4/Liste!F$5*Liste!F175))","v":""},{"$f":"IF(G$4=0,\"\",IF(Liste!G175=\"\",\"\",G$4/Liste!G$5*Liste!G175))","v":""},{"$f":"IF(H$4=0,\"\",IF(Liste!H175=\"\",\"\",H$4/Liste!H$5*Liste!H175))","v":""},{"$f":"IF(I$4=0,\"\",IF(Liste!I175=\"\",\"\",I$4/Liste!I$5*Liste!I175))","v":""},{"$f":"IF(J$4=0,\"\",IF(Liste!J175=\"\",\"\",J$4/Liste!J$5*Liste!J175))","v":""},{"$f":"IF(K$4=0,\"\",IF(Liste!K175=\"\",\"\",K$4/Liste!K$5*Liste!K175))","v":""},{"$f":"IF(L$4=0,\"\",IF(Liste!L175=\"\",\"\",L$4/Liste!L$5*Liste!L175))","v":""},{"$f":"IF(M$4=0,\"\",IF(Liste!M175=\"\",\"\",M$4/Liste!M$5*Liste!M175))","v":""},{"$f":"IF(N$4=0,\"\",IF(Liste!N175=\"\",\"\",N$4/Liste!N$5*Liste!N175))","v":""},{"$f":"IF(O$4=0,\"\",IF(Liste!O175=\"\",\"\",O$4/Liste!O$5*Liste!O175))","v":""},{"$f":"IF(P$4=0,\"\",IF(Liste!P175=\"\",\"\",P$4/Liste!P$5*Liste!P175))","v":""},{"$f":"IF(Q$4=0,\"\",IF(Liste!Q175=\"\",\"\",Q$4/Liste!Q$5*Liste!Q175))","v":""}]
["",{"$f":"IF(Liste!B176=\"\",\"\",Liste!B176)","v":""},{"$f":"IF(Liste!C176=\"\",\"\",Liste!C176)","v":""},{"$f":"IF(Liste!D176=\"\",\"\",Liste!D176)","v":""},{"$f":"IF(E$4=0,\"\",IF(Liste!E176=\"\",\"\",E$4/Liste!E$5*Liste!E176))","v":""},{"$f":"IF(F$4=0,\"\",IF(Liste!F176=\"\",\"\",F$4/Liste!F$5*Liste!F176))","v":""},{"$f":"IF(G$4=0,\"\",IF(Liste!G176=\"\",\"\",G$4/Liste!G$5*Liste!G176))","v":""},{"$f":"IF(H$4=0,\"\",IF(Liste!H176=\"\",\"\",H$4/Liste!H$5*Liste!H176))","v":""},{"$f":"IF(I$4=0,\"\",IF(Liste!I176=\"\",\"\",I$4/Liste!I$5*Liste!I176))","v":""},{"$f":"IF(J$4=0,\"\",IF(Liste!J176=\"\",\"\",J$4/Liste!J$5*Liste!J176))","v":""},{"$f":"IF(K$4=0,\"\",IF(Liste!K176=\"\",\"\",K$4/Liste!K$5*Liste!K176))","v":""},{"$f":"IF(L$4=0,\"\",IF(Liste!L176=\"\",\"\",L$4/Liste!L$5*Liste!L176))","v":""},{"$f":"IF(M$4=0,\"\",IF(Liste!M176=\"\",\"\",M$4/Liste!M$5*Liste!M176))","v":""},{"$f":"IF(N$4=0,\"\",IF(Liste!N176=\"\",\"\",N$4/Liste!N$5*Liste!N176))","v":""},{"$f":"IF(O$4=0,\"\",IF(Liste!O176=\"\",\"\",O$4/Liste!O$5*Liste!O176))","v":""},{"$f":"IF(P$4=0,\"\",IF(Liste!P176=\"\",\"\",P$4/Liste!P$5*Liste!P176))","v":""},{"$f":"IF(Q$4=0,\"\",IF(Liste!Q176=\"\",\"\",Q$4/Liste!Q$5*Liste!Q176))","v":""}]
["",{"$f":"IF(Liste!B177=\"\",\"\",Liste!B177)","v":""},{"$f":"IF(Liste!C177=\"\",\"\",Liste!C177)","v":""},{"$f":"IF(Liste!D177=\"\",\"\",Liste!D177)","v":""},{"$f":"IF(E$4=0,\"\",IF(Liste!E177=\"\",\"\",E$4/Liste!E$5*Liste!E177))","v":""},{"$f":"IF(F$4=0,\"\",IF(Liste!F177=\"\",\"\",F$4/Liste!F$5*Liste!F177))","v":""},{"$f":"IF(G$4=0,\"\",IF(Liste!G177=\"\",\"\",G$4/Liste!G$5*Liste!G177))","v":""},{"$f":"IF(H$4=0,\"\",IF(Liste!H177=\"\",\"\",H$4/Liste!H$5*Liste!H177))","v":""},{"$f":"IF(I$4=0,\"\",IF(Liste!I177=\"\",\"\",I$4/Liste!I$5*Liste!I177))","v":""},{"$f":"IF(J$4=0,\"\",IF(Liste!J177=\"\",\"\",J$4/Liste!J$5*Liste!J177))","v":""},{"$f":"IF(K$4=0,\"\",IF(Liste!K177=\"\",\"\",K$4/Liste!K$5*Liste!K177))","v":""},{"$f":"IF(L$4=0,\"\",IF(Liste!L177=\"\",\"\",L$4/Liste!L$5*Liste!L177))","v":""},{"$f":"IF(M$4=0,\"\",IF(Liste!M177=\"\",\"\",M$4/Liste!M$5*Liste!M177))","v":""},{"$f":"IF(N$4=0,\"\",IF(Liste!N177=\"\",\"\",N$4/Liste!N$5*Liste!N177))","v":""},{"$f":"IF(O$4=0,\"\",IF(Liste!O177=\"\",\"\",O$4/Liste!O$5*Liste!O177))","v":""},{"$f":"IF(P$4=0,\"\",IF(Liste!P177=\"\",\"\",P$4/Liste!P$5*Liste!P177))","v":""},{"$f":"IF(Q$4=0,\"\",IF(Liste!Q177=\"\",\"\",Q$4/Liste!Q$5*Liste!Q177))","v":""}]
["",{"$f":"IF(Liste!B178=\"\",\"\",Liste!B178)","v":""},{"$f":"IF(Liste!C178=\"\",\"\",Liste!C178)","v":""},{"$f":"IF(Liste!D178=\"\",\"\",Liste!D178)","v":""},{"$f":"IF(E$4=0,\"\",IF(Liste!E178=\"\",\"\",E$4/Liste!E$5*Liste!E178))","v":""},{"$f":"IF(F$4=0,\"\",IF(Liste!F178=\"\",\"\",F$4/Liste!F$5*Liste!F178))","v":""},{"$f":"IF(G$4=0,\"\",IF(Liste!G178=\"\",\"\",G$4/Liste!G$5*Liste!G178))","v":""},{"$f":"IF(H$4=0,\"\",IF(Liste!H178=\"\",\"\",H$4/Liste!H$5*Liste!H178))","v":""},{"$f":"IF(I$4=0,\"\",IF(Liste!I178=\"\",\"\",I$4/Liste!I$5*Liste!I178))","v":""},{"$f":"IF(J$4=0,\"\",IF(Liste!J178=\"\",\"\",J$4/Liste!J$5*Liste!J178))","v":""},{"$f":"IF(K$4=0,\"\",IF(Liste!K178=\"\",\"\",K$4/Liste!K$5*Liste!K178))","v":""},{"$f":"IF(L$4=0,\"\",IF(Liste!L178=\"\",\"\",L$4/Liste!L$5*Liste!L178))","v":""},{"$f":"IF(M$4=0,\"\",IF(Liste!M178=\"\",\"\",M$4/Liste!M$5*Liste!M178))","v":""},{"$f":"IF(N$4=0,\"\",IF(Liste!N178=\"\",\"\",N$4/Liste!N$5*Liste!N178))","v":""},{"$f":"IF(O$4=0,\"\",IF(Liste!O178=\"\",\"\",O$4/Liste!O$5*Liste!O178))","v":""},{"$f":"IF(P$4=0,\"\",IF(Liste!P178=\"\",\"\",P$4/Liste!P$5*Liste!P178))","v":""},{"$f":"IF(Q$4=0,\"\",IF(Liste!Q178=\"\",\"\",Q$4/Liste!Q$5*Liste!Q178))","v":""}]
["",{"$f":"IF(Liste!B179=\"\",\"\",Liste!B179)","v":""},{"$f":"IF(Liste!C179=\"\",\"\",Liste!C179)","v":""},{"$f":"IF(Liste!D179=\"\",\"\",Liste!D179)","v":""},{"$f":"IF(E$4=0,\"\",IF(Liste!E179=\"\",\"\",E$4/Liste!E$5*Liste!E179))","v":""},{"$f":"IF(F$4=0,\"\",IF(Liste!F179=\"\",\"\",F$4/Liste!F$5*Liste!F179))","v":""},{"$f":"IF(G$4=0,\"\",IF(Liste!G179=\"\",\"\",G$4/Liste!G$5*Liste!G179))","v":""},{"$f":"IF(H$4=0,\"\",IF(Liste!H179=\"\",\"\",H$4/Liste!H$5*Liste!H179))","v":""},{"$f":"IF(I$4=0,\"\",IF(Liste!I179=\"\",\"\",I$4/Liste!I$5*Liste!I179))","v":""},{"$f":"IF(J$4=0,\"\",IF(Liste!J179=\"\",\"\",J$4/Liste!J$5*Liste!J179))","v":""},{"$f":"IF(K$4=0,\"\",IF(Liste!K179=\"\",\"\",K$4/Liste!K$5*Liste!K179))","v":""},{"$f":"IF(L$4=0,\"\",IF(Liste!L179=\"\",\"\",L$4/Liste!L$5*Liste!L179))","v":""},{"$f":"IF(M$4=0,\"\",IF(Liste!M179=\"\",\"\",M$4/Liste!M$5*Liste!M179))","v":""},{"$f":"IF(N$4=0,\"\",IF(Liste!N179=\"\",\"\",N$4/Liste!N$5*Liste!N179))","v":""},{"$f":"IF(O$4=0,\"\",IF(Liste!O179=\"\",\"\",O$4/Liste!O$5*Liste!O179))","v":""},{"$f":"IF(P$4=0,\"\",IF(Liste!P179=\"\",\"\",P$4/Liste!P$5*Liste!P179))","v":""},{"$f":"IF(Q$4=0,\"\",IF(Liste!Q179=\"\",\"\",Q$4/Liste!Q$5*Liste!Q179))","v":""}]
["",{"$f":"IF(Liste!B180=\"\",\"\",Liste!B180)","v":""},{"$f":"IF(Liste!C180=\"\",\"\",Liste!C180)","v":""},{"$f":"IF(Liste!D180=\"\",\"\",Liste!D180)","v":""},{"$f":"IF(E$4=0,\"\",IF(Liste!E180=\"\",\"\",E$4/Liste!E$5*Liste!E180))","v":""},{"$f":"IF(F$4=0,\"\",IF(Liste!F180=\"\",\"\",F$4/Liste!F$5*Liste!F180))","v":""},{"$f":"IF(G$4=0,\"\",IF(Liste!G180=\"\",\"\",G$4/Liste!G$5*Liste!G180))","v":""},{"$f":"IF(H$4=0,\"\",IF(Liste!H180=\"\",\"\",H$4/Liste!H$5*Liste!H180))","v":""},{"$f":"IF(I$4=0,\"\",IF(Liste!I180=\"\",\"\",I$4/Liste!I$5*Liste!I180))","v":""},{"$f":"IF(J$4=0,\"\",IF(Liste!J180=\"\",\"\",J$4/Liste!J$5*Liste!J180))","v":""},{"$f":"IF(K$4=0,\"\",IF(Liste!K180=\"\",\"\",K$4/Liste!K$5*Liste!K180))","v":""},{"$f":"IF(L$4=0,\"\",IF(Liste!L180=\"\",\"\",L$4/Liste!L$5*Liste!L180))","v":""},{"$f":"IF(M$4=0,\"\",IF(Liste!M180=\"\",\"\",M$4/Liste!M$5*Liste!M180))","v":""},{"$f":"IF(N$4=0,\"\",IF(Liste!N180=\"\",\"\",N$4/Liste!N$5*Liste!N180))","v":""},{"$f":"IF(O$4=0,\"\",IF(Liste!O180=\"\",\"\",O$4/Liste!O$5*Liste!O180))","v":""},{"$f":"IF(P$4=0,\"\",IF(Liste!P180=\"\",\"\",P$4/Liste!P$5*Liste!P180))","v":""},{"$f":"IF(Q$4=0,\"\",IF(Liste!Q180=\"\",\"\",Q$4/Liste!Q$5*Liste!Q180))","v":""}]
["",{"$f":"IF(Liste!B181=\"\",\"\",Liste!B181)","v":""},{"$f":"IF(Liste!C181=\"\",\"\",Liste!C181)","v":""},{"$f":"IF(Liste!D181=\"\",\"\",Liste!D181)","v":""},{"$f":"IF(E$4=0,\"\",IF(Liste!E181=\"\",\"\",E$4/Liste!E$5*Liste!E181))","v":""},{"$f":"IF(F$4=0,\"\",IF(Liste!F181=\"\",\"\",F$4/Liste!F$5*Liste!F181))","v":""},{"$f":"IF(G$4=0,\"\",IF(Liste!G181=\"\",\"\",G$4/Liste!G$5*Liste!G181))","v":""},{"$f":"IF(H$4=0,\"\",IF(Liste!H181=\"\",\"\",H$4/Liste!H$5*Liste!H181))","v":""},{"$f":"IF(I$4=0,\"\",IF(Liste!I181=\"\",\"\",I$4/Liste!I$5*Liste!I181))","v":""},{"$f":"IF(J$4=0,\"\",IF(Liste!J181=\"\",\"\",J$4/Liste!J$5*Liste!J181))","v":""},{"$f":"IF(K$4=0,\"\",IF(Liste!K181=\"\",\"\",K$4/Liste!K$5*Liste!K181))","v":""},{"$f":"IF(L$4=0,\"\",IF(Liste!L181=\"\",\"\",L$4/Liste!L$5*Liste!L181))","v":""},{"$f":"IF(M$4=0,\"\",IF(Liste!M181=\"\",\"\",M$4/Liste!M$5*Liste!M181))","v":""},{"$f":"IF(N$4=0,\"\",IF(Liste!N181=\"\",\"\",N$4/Liste!N$5*Liste!N181))","v":""},{"$f":"IF(O$4=0,\"\",IF(Liste!O181=\"\",\"\",O$4/Liste!O$5*Liste!O181))","v":""},{"$f":"IF(P$4=0,\"\",IF(Liste!P181=\"\",\"\",P$4/Liste!P$5*Liste!P181))","v":""},{"$f":"IF(Q$4=0,\"\",IF(Liste!Q181=\"\",\"\",Q$4/Liste!Q$5*Liste!Q181))","v":""}]
["",{"$f":"IF(Liste!B182=\"\",\"\",Liste!B182)","v":""},{"$f":"IF(Liste!C182=\"\",\"\",Liste!C182)","v":""},{"$f":"IF(Liste!D182=\"\",\"\",Liste!D182)","v":""},{"$f":"IF(E$4=0,\"\",IF(Liste!E182=\"\",\"\",E$4/Liste!E$5*Liste!E182))","v":""},{"$f":"IF(F$4=0,\"\",IF(Liste!F182=\"\",\"\",F$4/Liste!F$5*Liste!F182))","v":""},{"$f":"IF(G$4=0,\"\",IF(Liste!G182=\"\",\"\",G$4/Liste!G$5*Liste!G182))","v":""},{"$f":"IF(H$4=0,\"\",IF(Liste!H182=\"\",\"\",H$4/Liste!H$5*Liste!H182))","v":""},{"$f":"IF(I$4=0,\"\",IF(Liste!I182=\"\",\"\",I$4/Liste!I$5*Liste!I182))","v":""},{"$f":"IF(J$4=0,\"\",IF(Liste!J182=\"\",\"\",J$4/Liste!J$5*Liste!J182))","v":""},{"$f":"IF(K$4=0,\"\",IF(Liste!K182=\"\",\"\",K$4/Liste!K$5*Liste!K182))","v":""},{"$f":"IF(L$4=0,\"\",IF(Liste!L182=\"\",\"\",L$4/Liste!L$5*Liste!L182))","v":""},{"$f":"IF(M$4=0,\"\",IF(Liste!M182=\"\",\"\",M$4/Liste!M$5*Liste!M182))","v":""},{"$f":"IF(N$4=0,\"\",IF(Liste!N182=\"\",\"\",N$4/Liste!N$5*Liste!N182))","v":""},{"$f":"IF(O$4=0,\"\",IF(Liste!O182=\"\",\"\",O$4/Liste!O$5*Liste!O182))","v":""},{"$f":"IF(P$4=0,\"\",IF(Liste!P182=\"\",\"\",P$4/Liste!P$5*Liste!P182))","v":""},{"$f":"IF(Q$4=0,\"\",IF(Liste!Q182=\"\",\"\",Q$4/Liste!Q$5*Liste!Q182))","v":""}]
["",{"$f":"IF(Liste!B183=\"\",\"\",Liste!B183)","v":""},{"$f":"IF(Liste!C183=\"\",\"\",Liste!C183)","v":""},{"$f":"IF(Liste!D183=\"\",\"\",Liste!D183)","v":""},{"$f":"IF(E$4=0,\"\",IF(Liste!E183=\"\",\"\",E$4/Liste!E$5*Liste!E183))","v":""},{"$f":"IF(F$4=0,\"\",IF(Liste!F183=\"\",\"\",F$4/Liste!F$5*Liste!F183))","v":""},{"$f":"IF(G$4=0,\"\",IF(Liste!G183=\"\",\"\",G$4/Liste!G$5*Liste!G183))","v":""},{"$f":"IF(H$4=0,\"\",IF(Liste!H183=\"\",\"\",H$4/Liste!H$5*Liste!H183))","v":""},{"$f":"IF(I$4=0,\"\",IF(Liste!I183=\"\",\"\",I$4/Liste!I$5*Liste!I183))","v":""},{"$f":"IF(J$4=0,\"\",IF(Liste!J183=\"\",\"\",J$4/Liste!J$5*Liste!J183))","v":""},{"$f":"IF(K$4=0,\"\",IF(Liste!K183=\"\",\"\",K$4/Liste!K$5*Liste!K183))","v":""},{"$f":"IF(L$4=0,\"\",IF(Liste!L183=\"\",\"\",L$4/Liste!L$5*Liste!L183))","v":""},{"$f":"IF(M$4=0,\"\",IF(Liste!M183=\"\",\"\",M$4/Liste!M$5*Liste!M183))","v":""},{"$f":"IF(N$4=0,\"\",IF(Liste!N183=\"\",\"\",N$4/Liste!N$5*Liste!N183))","v":""},{"$f":"IF(O$4=0,\"\",IF(Liste!O183=\"\",\"\",O$4/Liste!O$5*Liste!O183))","v":""},{"$f":"IF(P$4=0,\"\",IF(Liste!P183=\"\",\"\",P$4/Liste!P$5*Liste!P183))","v":""},{"$f":"IF(Q$4=0,\"\",IF(Liste!Q183=\"\",\"\",Q$4/Liste!Q$5*Liste!Q183))","v":""}]
["",{"$f":"IF(Liste!B184=\"\",\"\",Liste!B184)","v":""},{"$f":"IF(Liste!C184=\"\",\"\",Liste!C184)","v":""},{"$f":"IF(Liste!D184=\"\",\"\",Liste!D184)","v":""},{"$f":"IF(E$4=0,\"\",IF(Liste!E184=\"\",\"\",E$4/Liste!E$5*Liste!E184))","v":""},{"$f":"IF(F$4=0,\"\",IF(Liste!F184=\"\",\"\",F$4/Liste!F$5*Liste!F184))","v":""},{"$f":"IF(G$4=0,\"\",IF(Liste!G184=\"\",\"\",G$4/Liste!G$5*Liste!G184))","v":""},{"$f":"IF(H$4=0,\"\",IF(Liste!H184=\"\",\"\",H$4/Liste!H$5*Liste!H184))","v":""},{"$f":"IF(I$4=0,\"\",IF(Liste!I184=\"\",\"\",I$4/Liste!I$5*Liste!I184))","v":""},{"$f":"IF(J$4=0,\"\",IF(Liste!J184=\"\",\"\",J$4/Liste!J$5*Liste!J184))","v":""},{"$f":"IF(K$4=0,\"\",IF(Liste!K184=\"\",\"\",K$4/Liste!K$5*Liste!K184))","v":""},{"$f":"IF(L$4=0,\"\",IF(Liste!L184=\"\",\"\",L$4/Liste!L$5*Liste!L184))","v":""},{"$f":"IF(M$4=0,\"\",IF(Liste!M184=\"\",\"\",M$4/Liste!M$5*Liste!M184))","v":""},{"$f":"IF(N$4=0,\"\",IF(Liste!N184=\"\",\"\",N$4/Liste!N$5*Liste!N184))","v":""},{"$f":"IF(O$4=0,\"\",IF(Liste!O184=\"\",\"\",O$4/Liste!O$5*Liste!O184))","v":""},{"$f":"IF(P$4=0,\"\",IF(Liste!P184=\"\",\"\",P$4/Liste!P$5*Liste!P184))","v":""},{"$f":"IF(Q$4=0,\"\",IF(Liste!Q184=\"\",\"\",Q$4/Liste!Q$5*Liste!Q184))","v":""}]
["",{"$f":"IF(Liste!B185=\"\",\"\",Liste!B185)","v":""},{"$f":"IF(Liste!C185=\"\",\"\",Liste!C185)","v":""},{"$f":"IF(Liste!D185=\"\",\"\",Liste!D185)","v":""},{"$f":"IF(E$4=0,\"\",IF(Liste!E185=\"\",\"\",E$4/Liste!E$5*Liste!E185))","v":""},{"$f":"IF(F$4=0,\"\",IF(Liste!F185=\"\",\"\",F$4/Liste!F$5*Liste!F185))","v":""},{"$f":"IF(G$4=0,\"\",IF(Liste!G185=\"\",\"\",G$4/Liste!G$5*Liste!G185))","v":""},{"$f":"IF(H$4=0,\"\",IF(Liste!H185=\"\",\"\",H$4/Liste!H$5*Liste!H185))","v":""},{"$f":"IF(I$4=0,\"\",IF(Liste!I185=\"\",\"\",I$4/Liste!I$5*Liste!I185))","v":""},{"$f":"IF(J$4=0,\"\",IF(Liste!J185=\"\",\"\",J$4/Liste!J$5*Liste!J185))","v":""},{"$f":"IF(K$4=0,\"\",IF(Liste!K185=\"\",\"\",K$4/Liste!K$5*Liste!K185))","v":""},{"$f":"IF(L$4=0,\"\",IF(Liste!L185=\"\",\"\",L$4/Liste!L$5*Liste!L185))","v":""},{"$f":"IF(M$4=0,\"\",IF(Liste!M185=\"\",\"\",M$4/Liste!M$5*Liste!M185))","v":""},{"$f":"IF(N$4=0,\"\",IF(Liste!N185=\"\",\"\",N$4/Liste!N$5*Liste!N185))","v":""},{"$f":"IF(O$4=0,\"\",IF(Liste!O185=\"\",\"\",O$4/Liste!O$5*Liste!O185))","v":""},{"$f":"IF(P$4=0,\"\",IF(Liste!P185=\"\",\"\",P$4/Liste!P$5*Liste!P185))","v":""},{"$f":"IF(Q$4=0,\"\",IF(Liste!Q185=\"\",\"\",Q$4/Liste!Q$5*Liste!Q185))","v":""}]
["",{"$f":"IF(Liste!B186=\"\",\"\",Liste!B186)","v":""},{"$f":"IF(Liste!C186=\"\",\"\",Liste!C186)","v":""},{"$f":"IF(Liste!D186=\"\",\"\",Liste!D186)","v":""},{"$f":"IF(E$4=0,\"\",IF(Liste!E186=\"\",\"\",E$4/Liste!E$5*Liste!E186))","v":""},{"$f":"IF(F$4=0,\"\",IF(Liste!F186=\"\",\"\",F$4/Liste!F$5*Liste!F186))","v":""},{"$f":"IF(G$4=0,\"\",IF(Liste!G186=\"\",\"\",G$4/Liste!G$5*Liste!G186))","v":""},{"$f":"IF(H$4=0,\"\",IF(Liste!H186=\"\",\"\",H$4/Liste!H$5*Liste!H186))","v":""},{"$f":"IF(I$4=0,\"\",IF(Liste!I186=\"\",\"\",I$4/Liste!I$5*Liste!I186))","v":""},{"$f":"IF(J$4=0,\"\",IF(Liste!J186=\"\",\"\",J$4/Liste!J$5*Liste!J186))","v":""},{"$f":"IF(K$4=0,\"\",IF(Liste!K186=\"\",\"\",K$4/Liste!K$5*Liste!K186))","v":""},{"$f":"IF(L$4=0,\"\",IF(Liste!L186=\"\",\"\",L$4/Liste!L$5*Liste!L186))","v":""},{"$f":"IF(M$4=0,\"\",IF(Liste!M186=\"\",\"\",M$4/Liste!M$5*Liste!M186))","v":""},{"$f":"IF(N$4=0,\"\",IF(Liste!N186=\"\",\"\",N$4/Liste!N$5*Liste!N186))","v":""},{"$f":"IF(O$4=0,\"\",IF(Liste!O186=\"\",\"\",O$4/Liste!O$5*Liste!O186))","v":""},{"$f":"IF(P$4=0,\"\",IF(Liste!P186=\"\",\"\",P$4/Liste!P$5*Liste!P186))","v":""},{"$f":"IF(Q$4=0,\"\",IF(Liste!Q186=\"\",\"\",Q$4/Liste!Q$5*Liste!Q186))","v":""}]
["",{"$f":"IF(Liste!B187=\"\",\"\",Liste!B187)","v":""},{"$f":"IF(Liste!C187=\"\",\"\",Liste!C187)","v":""},{"$f":"IF(Liste!D187=\"\",\"\",Liste!D187)","v":""},{"$f":"IF(E$4=0,\"\",IF(Liste!E187=\"\",\"\",E$4/Liste!E$5*Liste!E187))","v":""},{"$f":"IF(F$4=0,\"\",IF(Liste!F187=\"\",\"\",F$4/Liste!F$5*Liste!F187))","v":""},{"$f":"IF(G$4=0,\"\",IF(Liste!G187=\"\",\"\",G$4/Liste!G$5*Liste!G187))","v":""},{"$f":"IF(H$4=0,\"\",IF(Liste!H187=\"\",\"\",H$4/Liste!H$5*Liste!H187))","v":""},{"$f":"IF(I$4=0,\"\",IF(Liste!I187=\"\",\"\",I$4/Liste!I$5*Liste!I187))","v":""},{"$f":"IF(J$4=0,\"\",IF(Liste!J187=\"\",\"\",J$4/Liste!J$5*Liste!J187))","v":""},{"$f":"IF(K$4=0,\"\",IF(Liste!K187=\"\",\"\",K$4/Liste!K$5*Liste!K187))","v":""},{"$f":"IF(L$4=0,\"\",IF(Liste!L187=\"\",\"\",L$4/Liste!L$5*Liste!L187))","v":""},{"$f":"IF(M$4=0,\"\",IF(Liste!M187=\"\",\"\",M$4/Liste!M$5*Liste!M187))","v":""},{"$f":"IF(N$4=0,\"\",IF(Liste!N187=\"\",\"\",N$4/Liste!N$5*Liste!N187))","v":""},{"$f":"IF(O$4=0,\"\",IF(Liste!O187=\"\",\"\",O$4/Liste!O$5*Liste!O187))","v":""},{"$f":"IF(P$4=0,\"\",IF(Liste!P187=\"\",\"\",P$4/Liste!P$5*Liste!P187))","v":""},{"$f":"IF(Q$4=0,\"\",IF(Liste!Q187=\"\",\"\",Q$4/Liste!Q$5*Liste!Q187))","v":""}]
["",{"$f":"IF(Liste!B188=\"\",\"\",Liste!B188)","v":""},{"$f":"IF(Liste!C188=\"\",\"\",Liste!C188)","v":""},{"$f":"IF(Liste!D188=\"\",\"\",Liste!D188)","v":""},{"$f":"IF(E$4=0,\"\",IF(Liste!E188=\"\",\"\",E$4/Liste!E$5*Liste!E188))","v":""},{"$f":"IF(F$4=0,\"\",IF(Liste!F188=\"\",\"\",F$4/Liste!F$5*Liste!F188))","v":""},{"$f":"IF(G$4=0,\"\",IF(Liste!G188=\"\",\"\",G$4/Liste!G$5*Liste!G188))","v":""},{"$f":"IF(H$4=0,\"\",IF(Liste!H188=\"\",\"\",H$4/Liste!H$5*Liste!H188))","v":""},{"$f":"IF(I$4=0,\"\",IF(Liste!I188=\"\",\"\",I$4/Liste!I$5*Liste!I188))","v":""},{"$f":"IF(J$4=0,\"\",IF(Liste!J188=\"\",\"\",J$4/Liste!J$5*Liste!J188))","v":""},{"$f":"IF(K$4=0,\"\",IF(Liste!K188=\"\",\"\",K$4/Liste!K$5*Liste!K188))","v":""},{"$f":"IF(L$4=0,\"\",IF(Liste!L188=\"\",\"\",L$4/Liste!L$5*Liste!L188))","v":""},{"$f":"IF(M$4=0,\"\",IF(Liste!M188=\"\",\"\",M$4/Liste!M$5*Liste!M188))","v":""},{"$f":"IF(N$4=0,\"\",IF(Liste!N188=\"\",\"\",N$4/Liste!N$5*Liste!N188))","v":""},{"$f":"IF(O$4=0,\"\",IF(Liste!O188=\"\",\"\",O$4/Liste!O$5*Liste!O188))","v":""},{"$f":"IF(P$4=0,\"\",IF(Liste!P188=\"\",\"\",P$4/Liste!P$5*Liste!P188))","v":""},{"$f":"IF(Q$4=0,\"\",IF(Liste!Q188=\"\",\"\",Q$4/Liste!Q$5*Liste!Q188))","v":""}]
["",{"$f":"IF(Liste!B189=\"\",\"\",Liste!B189)","v":""},{"$f":"IF(Liste!C189=\"\",\"\",Liste!C189)","v":""},{"$f":"IF(Liste!D189=\"\",\"\",Liste!D189)","v":""},{"$f":"IF(E$4=0,\"\",IF(Liste!E189=\"\",\"\",E$4/Liste!E$5*Liste!E189))","v":""},{"$f":"IF(F$4=0,\"\",IF(Liste!F189=\"\",\"\",F$4/Liste!F$5*Liste!F189))","v":""},{"$f":"IF(G$4=0,\"\",IF(Liste!G189=\"\",\"\",G$4/Liste!G$5*Liste!G189))","v":""},{"$f":"IF(H$4=0,\"\",IF(Liste!H189=\"\",\"\",H$4/Liste!H$5*Liste!H189))","v":""},{"$f":"IF(I$4=0,\"\",IF(Liste!I189=\"\",\"\",I$4/Liste!I$5*Liste!I189))","v":""},{"$f":"IF(J$4=0,\"\",IF(Liste!J189=\"\",\"\",J$4/Liste!J$5*Liste!J189))","v":""},{"$f":"IF(K$4=0,\"\",IF(Liste!K189=\"\",\"\",K$4/Liste!K$5*Liste!K189))","v":""},{"$f":"IF(L$4=0,\"\",IF(Liste!L189=\"\",\"\",L$4/Liste!L$5*Liste!L189))","v":""},{"$f":"IF(M$4=0,\"\",IF(Liste!M189=\"\",\"\",M$4/Liste!M$5*Liste!M189))","v":""},{"$f":"IF(N$4=0,\"\",IF(Liste!N189=\"\",\"\",N$4/Liste!N$5*Liste!N189))","v":""},{"$f":"IF(O$4=0,\"\",IF(Liste!O189=\"\",\"\",O$4/Liste!O$5*Liste!O189))","v":""},{"$f":"IF(P$4=0,\"\",IF(Liste!P189=\"\",\"\",P$4/Liste!P$5*Liste!P189))","v":""},{"$f":"IF(Q$4=0,\"\",IF(Liste!Q189=\"\",\"\",Q$4/Liste!Q$5*Liste!Q189))","v":""}]
["",{"$f":"IF(Liste!B190=\"\",\"\",Liste!B190)","v":""},{"$f":"IF(Liste!C190=\"\",\"\",Liste!C190)","v":""},{"$f":"IF(Liste!D190=\"\",\"\",Liste!D190)","v":""},{"$f":"IF(E$4=0,\"\",IF(Liste!E190=\"\",\"\",E$4/Liste!E$5*Liste!E190))","v":""},{"$f":"IF(F$4=0,\"\",IF(Liste!F190=\"\",\"\",F$4/Liste!F$5*Liste!F190))","v":""},{"$f":"IF(G$4=0,\"\",IF(Liste!G190=\"\",\"\",G$4/Liste!G$5*Liste!G190))","v":""},{"$f":"IF(H$4=0,\"\",IF(Liste!H190=\"\",\"\",H$4/Liste!H$5*Liste!H190))","v":""},{"$f":"IF(I$4=0,\"\",IF(Liste!I190=\"\",\"\",I$4/Liste!I$5*Liste!I190))","v":""},{"$f":"IF(J$4=0,\"\",IF(Liste!J190=\"\",\"\",J$4/Liste!J$5*Liste!J190))","v":""},{"$f":"IF(K$4=0,\"\",IF(Liste!K190=\"\",\"\",K$4/Liste!K$5*Liste!K190))","v":""},{"$f":"IF(L$4=0,\"\",IF(Liste!L190=\"\",\"\",L$4/Liste!L$5*Liste!L190))","v":""},{"$f":"IF(M$4=0,\"\",IF(Liste!M190=\"\",\"\",M$4/Liste!M$5*Liste!M190))","v":""},{"$f":"IF(N$4=0,\"\",IF(Liste!N190=\"\",\"\",N$4/Liste!N$5*Liste!N190))","v":""},{"$f":"IF(O$4=0,\"\",IF(Liste!O190=\"\",\"\",O$4/Liste!O$5*Liste!O190))","v":""},{"$f":"IF(P$4=0,\"\",IF(Liste!P190=\"\",\"\",P$4/Liste!P$5*Liste!P190))","v":""},{"$f":"IF(Q$4=0,\"\",IF(Liste!Q190=\"\",\"\",Q$4/Liste!Q$5*Liste!Q190))","v":""}]
["",{"$f":"IF(Liste!B191=\"\",\"\",Liste!B191)","v":""},{"$f":"IF(Liste!C191=\"\",\"\",Liste!C191)","v":""},{"$f":"IF(Liste!D191=\"\",\"\",Liste!D191)","v":""},{"$f":"IF(E$4=0,\"\",IF(Liste!E191=\"\",\"\",E$4/Liste!E$5*Liste!E191))","v":""},{"$f":"IF(F$4=0,\"\",IF(Liste!F191=\"\",\"\",F$4/Liste!F$5*Liste!F191))","v":""},{"$f":"IF(G$4=0,\"\",IF(Liste!G191=\"\",\"\",G$4/Liste!G$5*Liste!G191))","v":""},{"$f":"IF(H$4=0,\"\",IF(Liste!H191=\"\",\"\",H$4/Liste!H$5*Liste!H191))","v":""},{"$f":"IF(I$4=0,\"\",IF(Liste!I191=\"\",\"\",I$4/Liste!I$5*Liste!I191))","v":""},{"$f":"IF(J$4=0,\"\",IF(Liste!J191=\"\",\"\",J$4/Liste!J$5*Liste!J191))","v":""},{"$f":"IF(K$4=0,\"\",IF(Liste!K191=\"\",\"\",K$4/Liste!K$5*Liste!K191))","v":""},{"$f":"IF(L$4=0,\"\",IF(Liste!L191=\"\",\"\",L$4/Liste!L$5*Liste!L191))","v":""},{"$f":"IF(M$4=0,\"\",IF(Liste!M191=\"\",\"\",M$4/Liste!M$5*Liste!M191))","v":""},{"$f":"IF(N$4=0,\"\",IF(Liste!N191=\"\",\"\",N$4/Liste!N$5*Liste!N191))","v":""},{"$f":"IF(O$4=0,\"\",IF(Liste!O191=\"\",\"\",O$4/Liste!O$5*Liste!O191))","v":""},{"$f":"IF(P$4=0,\"\",IF(Liste!P191=\"\",\"\",P$4/Liste!P$5*Liste!P191))","v":""},{"$f":"IF(Q$4=0,\"\",IF(Liste!Q191=\"\",\"\",Q$4/Liste!Q$5*Liste!Q191))","v":""}]
["",{"$f":"IF(Liste!B192=\"\",\"\",Liste!B192)","v":""},{"$f":"IF(Liste!C192=\"\",\"\",Liste!C192)","v":""},{"$f":"IF(Liste!D192=\"\",\"\",Liste!D192)","v":""},{"$f":"IF(E$4=0,\"\",IF(Liste!E192=\"\",\"\",E$4/Liste!E$5*Liste!E192))","v":""},{"$f":"IF(F$4=0,\"\",IF(Liste!F192=\"\",\"\",F$4/Liste!F$5*Liste!F192))","v":""},{"$f":"IF(G$4=0,\"\",IF(Liste!G192=\"\",\"\",G$4/Liste!G$5*Liste!G192))","v":""},{"$f":"IF(H$4=0,\"\",IF(Liste!H192=\"\",\"\",H$4/Liste!H$5*Liste!H192))","v":""},{"$f":"IF(I$4=0,\"\",IF(Liste!I192=\"\",\"\",I$4/Liste!I$5*Liste!I192))","v":""},{"$f":"IF(J$4=0,\"\",IF(Liste!J192=\"\",\"\",J$4/Liste!J$5*Liste!J192))","v":""},{"$f":"IF(K$4=0,\"\",IF(Liste!K192=\"\",\"\",K$4/Liste!K$5*Liste!K192))","v":""},{"$f":"IF(L$4=0,\"\",IF(Liste!L192=\"\",\"\",L$4/Liste!L$5*Liste!L192))","v":""},{"$f":"IF(M$4=0,\"\",IF(Liste!M192=\"\",\"\",M$4/Liste!M$5*Liste!M192))","v":""},{"$f":"IF(N$4=0,\"\",IF(Liste!N192=\"\",\"\",N$4/Liste!N$5*Liste!N192))","v":""},{"$f":"IF(O$4=0,\"\",IF(Liste!O192=\"\",\"\",O$4/Liste!O$5*Liste!O192))","v":""},{"$f":"IF(P$4=0,\"\",IF(Liste!P192=\"\",\"\",P$4/Liste!P$5*Liste!P192))","v":""},{"$f":"IF(Q$4=0,\"\",IF(Liste!Q192=\"\",\"\",Q$4/Liste!Q$5*Liste!Q192))","v":""}]
["",{"$f":"IF(Liste!B193=\"\",\"\",Liste!B193)","v":""},{"$f":"IF(Liste!C193=\"\",\"\",Liste!C193)","v":""},{"$f":"IF(Liste!D193=\"\",\"\",Liste!D193)","v":""},{"$f":"IF(E$4=0,\"\",IF(Liste!E193=\"\",\"\",E$4/Liste!E$5*Liste!E193))","v":""},{"$f":"IF(F$4=0,\"\",IF(Liste!F193=\"\",\"\",F$4/Liste!F$5*Liste!F193))","v":""},{"$f":"IF(G$4=0,\"\",IF(Liste!G193=\"\",\"\",G$4/Liste!G$5*Liste!G193))","v":""},{"$f":"IF(H$4=0,\"\",IF(Liste!H193=\"\",\"\",H$4/Liste!H$5*Liste!H193))","v":""},{"$f":"IF(I$4=0,\"\",IF(Liste!I193=\"\",\"\",I$4/Liste!I$5*Liste!I193))","v":""},{"$f":"IF(J$4=0,\"\",IF(Liste!J193=\"\",\"\",J$4/Liste!J$5*Liste!J193))","v":""},{"$f":"IF(K$4=0,\"\",IF(Liste!K193=\"\",\"\",K$4/Liste!K$5*Liste!K193))","v":""},{"$f":"IF(L$4=0,\"\",IF(Liste!L193=\"\",\"\",L$4/Liste!L$5*Liste!L193))","v":""},{"$f":"IF(M$4=0,\"\",IF(Liste!M193=\"\",\"\",M$4/Liste!M$5*Liste!M193))","v":""},{"$f":"IF(N$4=0,\"\",IF(Liste!N193=\"\",\"\",N$4/Liste!N$5*Liste!N193))","v":""},{"$f":"IF(O$4=0,\"\",IF(Liste!O193=\"\",\"\",O$4/Liste!O$5*Liste!O193))","v":""},{"$f":"IF(P$4=0,\"\",IF(Liste!P193=\"\",\"\",P$4/Liste!P$5*Liste!P193))","v":""},{"$f":"IF(Q$4=0,\"\",IF(Liste!Q193=\"\",\"\",Q$4/Liste!Q$5*Liste!Q193))","v":""}]
["",{"$f":"IF(Liste!B194=\"\",\"\",Liste!B194)","v":""},{"$f":"IF(Liste!C194=\"\",\"\",Liste!C194)","v":""},{"$f":"IF(Liste!D194=\"\",\"\",Liste!D194)","v":""},{"$f":"IF(E$4=0,\"\",IF(Liste!E194=\"\",\"\",E$4/Liste!E$5*Liste!E194))","v":""},{"$f":"IF(F$4=0,\"\",IF(Liste!F194=\"\",\"\",F$4/Liste!F$5*Liste!F194))","v":""},{"$f":"IF(G$4=0,\"\",IF(Liste!G194=\"\",\"\",G$4/Liste!G$5*Liste!G194))","v":""},{"$f":"IF(H$4=0,\"\",IF(Liste!H194=\"\",\"\",H$4/Liste!H$5*Liste!H194))","v":""},{"$f":"IF(I$4=0,\"\",IF(Liste!I194=\"\",\"\",I$4/Liste!I$5*Liste!I194))","v":""},{"$f":"IF(J$4=0,\"\",IF(Liste!J194=\"\",\"\",J$4/Liste!J$5*Liste!J194))","v":""},{"$f":"IF(K$4=0,\"\",IF(Liste!K194=\"\",\"\",K$4/Liste!K$5*Liste!K194))","v":""},{"$f":"IF(L$4=0,\"\",IF(Liste!L194=\"\",\"\",L$4/Liste!L$5*Liste!L194))","v":""},{"$f":"IF(M$4=0,\"\",IF(Liste!M194=\"\",\"\",M$4/Liste!M$5*Liste!M194))","v":""},{"$f":"IF(N$4=0,\"\",IF(Liste!N194=\"\",\"\",N$4/Liste!N$5*Liste!N194))","v":""},{"$f":"IF(O$4=0,\"\",IF(Liste!O194=\"\",\"\",O$4/Liste!O$5*Liste!O194))","v":""},{"$f":"IF(P$4=0,\"\",IF(Liste!P194=\"\",\"\",P$4/Liste!P$5*Liste!P194))","v":""},{"$f":"IF(Q$4=0,\"\",IF(Liste!Q194=\"\",\"\",Q$4/Liste!Q$5*Liste!Q194))","v":""}]
["",{"$f":"IF(Liste!B195=\"\",\"\",Liste!B195)","v":""},{"$f":"IF(Liste!C195=\"\",\"\",Liste!C195)","v":""},{"$f":"IF(Liste!D195=\"\",\"\",Liste!D195)","v":""},{"$f":"IF(E$4=0,\"\",IF(Liste!E195=\"\",\"\",E$4/Liste!E$5*Liste!E195))","v":""},{"$f":"IF(F$4=0,\"\",IF(Liste!F195=\"\",\"\",F$4/Liste!F$5*Liste!F195))","v":""},{"$f":"IF(G$4=0,\"\",IF(Liste!G195=\"\",\"\",G$4/Liste!G$5*Liste!G195))","v":""},{"$f":"IF(H$4=0,\"\",IF(Liste!H195=\"\",\"\",H$4/Liste!H$5*Liste!H195))","v":""},{"$f":"IF(I$4=0,\"\",IF(Liste!I195=\"\",\"\",I$4/Liste!I$5*Liste!I195))","v":""},{"$f":"IF(J$4=0,\"\",IF(Liste!J195=\"\",\"\",J$4/Liste!J$5*Liste!J195))","v":""},{"$f":"IF(K$4=0,\"\",IF(Liste!K195=\"\",\"\",K$4/Liste!K$5*Liste!K195))","v":""},{"$f":"IF(L$4=0,\"\",IF(Liste!L195=\"\",\"\",L$4/Liste!L$5*Liste!L195))","v":""},{"$f":"IF(M$4=0,\"\",IF(Liste!M195=\"\",\"\",M$4/Liste!M$5*Liste!M195))","v":""},{"$f":"IF(N$4=0,\"\",IF(Liste!N195=\"\",\"\",N$4/Liste!N$5*Liste!N195))","v":""},{"$f":"IF(O$4=0,\"\",IF(Liste!O195=\"\",\"\",O$4/Liste!O$5*Liste!O195))","v":""},{"$f":"IF(P$4=0,\"\",IF(Liste!P195=\"\",\"\",P$4/Liste!P$5*Liste!P195))","v":""},{"$f":"IF(Q$4=0,\"\",IF(Liste!Q195=\"\",\"\",Q$4/Liste!Q$5*Liste!Q195))","v":""}]
["",{"$f":"IF(Liste!B196=\"\",\"\",Liste!B196)","v":""},{"$f":"IF(Liste!C196=\"\",\"\",Liste!C196)","v":""},{"$f":"IF(Liste!D196=\"\",\"\",Liste!D196)","v":""},{"$f":"IF(E$4=0,\"\",IF(Liste!E196=\"\",\"\",E$4/Liste!E$5*Liste!E196))","v":""},{"$f":"IF(F$4=0,\"\",IF(Liste!F196=\"\",\"\",F$4/Liste!F$5*Liste!F196))","v":""},{"$f":"IF(G$4=0,\"\",IF(Liste!G196=\"\",\"\",G$4/Liste!G$5*Liste!G196))","v":""},{"$f":"IF(H$4=0,\"\",IF(Liste!H196=\"\",\"\",H$4/Liste!H$5*Liste!H196))","v":""},{"$f":"IF(I$4=0,\"\",IF(Liste!I196=\"\",\"\",I$4/Liste!I$5*Liste!I196))","v":""},{"$f":"IF(J$4=0,\"\",IF(Liste!J196=\"\",\"\",J$4/Liste!J$5*Liste!J196))","v":""},{"$f":"IF(K$4=0,\"\",IF(Liste!K196=\"\",\"\",K$4/Liste!K$5*Liste!K196))","v":""},{"$f":"IF(L$4=0,\"\",IF(Liste!L196=\"\",\"\",L$4/Liste!L$5*Liste!L196))","v":""},{"$f":"IF(M$4=0,\"\",IF(Liste!M196=\"\",\"\",M$4/Liste!M$5*Liste!M196))","v":""},{"$f":"IF(N$4=0,\"\",IF(Liste!N196=\"\",\"\",N$4/Liste!N$5*Liste!N196))","v":""},{"$f":"IF(O$4=0,\"\",IF(Liste!O196=\"\",\"\",O$4/Liste!O$5*Liste!O196))","v":""},{"$f":"IF(P$4=0,\"\",IF(Liste!P196=\"\",\"\",P$4/Liste!P$5*Liste!P196))","v":""},{"$f":"IF(Q$4=0,\"\",IF(Liste!Q196=\"\",\"\",Q$4/Liste!Q$5*Liste!Q196))","v":""}]
["",{"$f":"IF(Liste!B197=\"\",\"\",Liste!B197)","v":""},{"$f":"IF(Liste!C197=\"\",\"\",Liste!C197)","v":""},{"$f":"IF(Liste!D197=\"\",\"\",Liste!D197)","v":""},{"$f":"IF(E$4=0,\"\",IF(Liste!E197=\"\",\"\",E$4/Liste!E$5*Liste!E197))","v":""},{"$f":"IF(F$4=0,\"\",IF(Liste!F197=\"\",\"\",F$4/Liste!F$5*Liste!F197))","v":""},{"$f":"IF(G$4=0,\"\",IF(Liste!G197=\"\",\"\",G$4/Liste!G$5*Liste!G197))","v":""},{"$f":"IF(H$4=0,\"\",IF(Liste!H197=\"\",\"\",H$4/Liste!H$5*Liste!H197))","v":""},{"$f":"IF(I$4=0,\"\",IF(Liste!I197=\"\",\"\",I$4/Liste!I$5*Liste!I197))","v":""},{"$f":"IF(J$4=0,\"\",IF(Liste!J197=\"\",\"\",J$4/Liste!J$5*Liste!J197))","v":""},{"$f":"IF(K$4=0,\"\",IF(Liste!K197=\"\",\"\",K$4/Liste!K$5*Liste!K197))","v":""},{"$f":"IF(L$4=0,\"\",IF(Liste!L197=\"\",\"\",L$4/Liste!L$5*Liste!L197))","v":""},{"$f":"IF(M$4=0,\"\",IF(Liste!M197=\"\",\"\",M$4/Liste!M$5*Liste!M197))","v":""},{"$f":"IF(N$4=0,\"\",IF(Liste!N197=\"\",\"\",N$4/Liste!N$5*Liste!N197))","v":""},{"$f":"IF(O$4=0,\"\",IF(Liste!O197=\"\",\"\",O$4/Liste!O$5*Liste!O197))","v":""},{"$f":"IF(P$4=0,\"\",IF(Liste!P197=\"\",\"\",P$4/Liste!P$5*Liste!P197))","v":""},{"$f":"IF(Q$4=0,\"\",IF(Liste!Q197=\"\",\"\",Q$4/Liste!Q$5*Liste!Q197))","v":""}]
["",{"$f":"IF(Liste!B198=\"\",\"\",Liste!B198)","v":""},{"$f":"IF(Liste!C198=\"\",\"\",Liste!C198)","v":""},{"$f":"IF(Liste!D198=\"\",\"\",Liste!D198)","v":""},{"$f":"IF(E$4=0,\"\",IF(Liste!E198=\"\",\"\",E$4/Liste!E$5*Liste!E198))","v":""},{"$f":"IF(F$4=0,\"\",IF(Liste!F198=\"\",\"\",F$4/Liste!F$5*Liste!F198))","v":""},{"$f":"IF(G$4=0,\"\",IF(Liste!G198=\"\",\"\",G$4/Liste!G$5*Liste!G198))","v":""},{"$f":"IF(H$4=0,\"\",IF(Liste!H198=\"\",\"\",H$4/Liste!H$5*Liste!H198))","v":""},{"$f":"IF(I$4=0,\"\",IF(Liste!I198=\"\",\"\",I$4/Liste!I$5*Liste!I198))","v":""},{"$f":"IF(J$4=0,\"\",IF(Liste!J198=\"\",\"\",J$4/Liste!J$5*Liste!J198))","v":""},{"$f":"IF(K$4=0,\"\",IF(Liste!K198=\"\",\"\",K$4/Liste!K$5*Liste!K198))","v":""},{"$f":"IF(L$4=0,\"\",IF(Liste!L198=\"\",\"\",L$4/Liste!L$5*Liste!L198))","v":""},{"$f":"IF(M$4=0,\"\",IF(Liste!M198=\"\",\"\",M$4/Liste!M$5*Liste!M198))","v":""},{"$f":"IF(N$4=0,\"\",IF(Liste!N198=\"\",\"\",N$4/Liste!N$5*Liste!N198))","v":""},{"$f":"IF(O$4=0,\"\",IF(Liste!O198=\"\",\"\",O$4/Liste!O$5*Liste!O198))","v":""},{"$f":"IF(P$4=0,\"\",IF(Liste!P198=\"\",\"\",P$4/Liste!P$5*Liste!P198))","v":""},{"$f":"IF(Q$4=0,\"\",IF(Liste!Q198=\"\",\"\",Q$4/Liste!Q$5*Liste!Q198))","v":""}]
["",{"$f":"IF(Liste!B199=\"\",\"\",Liste!B199)","v":""},{"$f":"IF(Liste!C199=\"\",\"\",Liste!C199)","v":""},{"$f":"IF(Liste!D199=\"\",\"\",Liste!D199)","v":""},{"$f":"IF(E$4=0,\"\",IF(Liste!E199=\"\",\"\",E$4/Liste!E$5*Liste!E199))","v":""},{"$f":"IF(F$4=0,\"\",IF(Liste!F199=\"\",\"\",F$4/Liste!F$5*Liste!F199))","v":""},{"$f":"IF(G$4=0,\"\",IF(Liste!G199=\"\",\"\",G$4/Liste!G$5*Liste!G199))","v":""},{"$f":"IF(H$4=0,\"\",IF(Liste!H199=\"\",\"\",H$4/Liste!H$5*Liste!H199))","v":""},{"$f":"IF(I$4=0,\"\",IF(Liste!I199=\"\",\"\",I$4/Liste!I$5*Liste!I199))","v":""},{"$f":"IF(J$4=0,\"\",IF(Liste!J199=\"\",\"\",J$4/Liste!J$5*Liste!J199))","v":""},{"$f":"IF(K$4=0,\"\",IF(Liste!K199=\"\",\"\",K$4/Liste!K$5*Liste!K199))","v":""},{"$f":"IF(L$4=0,\"\",IF(Liste!L199=\"\",\"\",L$4/Liste!L$5*Liste!L199))","v":""},{"$f":"IF(M$4=0,\"\",IF(Liste!M199=\"\",\"\",M$4/Liste!M$5*Liste!M199))","v":""},{"$f":"IF(N$4=0,\"\",IF(Liste!N199=\"\",\"\",N$4/Liste!N$5*Liste!N199))","v":""},{"$f":"IF(O$4=0,\"\",IF(Liste!O199=\"\",\"\",O$4/Liste!O$5*Liste!O199))","v":""},{"$f":"IF(P$4=0,\"\",IF(Liste!P199=\"\",\"\",P$4/Liste!P$5*Liste!P199))","v":""},{"$f":"IF(Q$4=0,\"\",IF(Liste!Q199=\"\",\"\",Q$4/Liste!Q$5*Liste!Q199))","v":""}]
["",{"$f":"IF(Liste!B200=\"\",\"\",Liste!B200)","v":""},{"$f":"IF(Liste!C200=\"\",\"\",Liste!C200)","v":""},{"$f":"IF(Liste!D200=\"\",\"\",Liste!D200)","v":""},{"$f":"IF(E$4=0,\"\",IF(Liste!E200=\"\",\"\",E$4/Liste!E$5*Liste!E200))","v":""},{"$f":"IF(F$4=0,\"\",IF(Liste!F200=\"\",\"\",F$4/Liste!F$5*Liste!F200))","v":""},{"$f":"IF(G$4=0,\"\",IF(Liste!G200=\"\",\"\",G$4/Liste!G$5*Liste!G200))","v":""},{"$f":"IF(H$4=0,\"\",IF(Liste!H200=\"\",\"\",H$4/Liste!H$5*Liste!H200))","v":""},{"$f":"IF(I$4=0,\"\",IF(Liste!I200=\"\",\"\",I$4/Liste!I$5*Liste!I200))","v":""},{"$f":"IF(J$4=0,\"\",IF(Liste!J200=\"\",\"\",J$4/Liste!J$5*Liste!J200))","v":""},{"$f":"IF(K$4=0,\"\",IF(Liste!K200=\"\",\"\",K$4/Liste!K$5*Liste!K200))","v":""},{"$f":"IF(L$4=0,\"\",IF(Liste!L200=\"\",\"\",L$4/Liste!L$5*Liste!L200))","v":""},{"$f":"IF(M$4=0,\"\",IF(Liste!M200=\"\",\"\",M$4/Liste!M$5*Liste!M200))","v":""},{"$f":"IF(N$4=0,\"\",IF(Liste!N200=\"\",\"\",N$4/Liste!N$5*Liste!N200))","v":""},{"$f":"IF(O$4=0,\"\",IF(Liste!O200=\"\",\"\",O$4/Liste!O$5*Liste!O200))","v":""},{"$f":"IF(P$4=0,\"\",IF(Liste!P200=\"\",\"\",P$4/Liste!P$5*Liste!P200))","v":""},{"$f":"IF(Q$4=0,\"\",IF(Liste!Q200=\"\",\"\",Q$4/Liste!Q$5*Liste!Q200))","v":""}]
["",{"$f":"IF(Liste!B201=\"\",\"\",Liste!B201)","v":""},{"$f":"IF(Liste!C201=\"\",\"\",Liste!C201)","v":""},{"$f":"IF(Liste!D201=\"\",\"\",Liste!D201)","v":""},{"$f":"IF(E$4=0,\"\",IF(Liste!E201=\"\",\"\",E$4/Liste!E$5*Liste!E201))","v":""},{"$f":"IF(F$4=0,\"\",IF(Liste!F201=\"\",\"\",F$4/Liste!F$5*Liste!F201))","v":""},{"$f":"IF(G$4=0,\"\",IF(Liste!G201=\"\",\"\",G$4/Liste!G$5*Liste!G201))","v":""},{"$f":"IF(H$4=0,\"\",IF(Liste!H201=\"\",\"\",H$4/Liste!H$5*Liste!H201))","v":""},{"$f":"IF(I$4=0,\"\",IF(Liste!I201=\"\",\"\",I$4/Liste!I$5*Liste!I201))","v":""},{"$f":"IF(J$4=0,\"\",IF(Liste!J201=\"\",\"\",J$4/Liste!J$5*Liste!J201))","v":""},{"$f":"IF(K$4=0,\"\",IF(Liste!K201=\"\",\"\",K$4/Liste!K$5*Liste!K201))","v":""},{"$f":"IF(L$4=0,\"\",IF(Liste!L201=\"\",\"\",L$4/Liste!L$5*Liste!L201))","v":""},{"$f":"IF(M$4=0,\"\",IF(Liste!M201=\"\",\"\",M$4/Liste!M$5*Liste!M201))","v":""},{"$f":"IF(N$4=0,\"\",IF(Liste!N201=\"\",\"\",N$4/Liste!N$5*Liste!N201))","v":""},{"$f":"IF(O$4=0,\"\",IF(Liste!O201=\"\",\"\",O$4/Liste!O$5*Liste!O201))","v":""},{"$f":"IF(P$4=0,\"\",IF(Liste!P201=\"\",\"\",P$4/Liste!P$5*Liste!P201))","v":""},{"$f":"IF(Q$4=0,\"\",IF(Liste!Q201=\"\",\"\",Q$4/Liste!Q$5*Liste!Q201))","v":""}]
["",{"$f":"IF(Liste!B202=\"\",\"\",Liste!B202)","v":""},{"$f":"IF(Liste!C202=\"\",\"\",Liste!C202)","v":""},{"$f":"IF(Liste!D202=\"\",\"\",Liste!D202)","v":""},{"$f":"IF(E$4=0,\"\",IF(Liste!E202=\"\",\"\",E$4/Liste!E$5*Liste!E202))","v":""},{"$f":"IF(F$4=0,\"\",IF(Liste!F202=\"\",\"\",F$4/Liste!F$5*Liste!F202))","v":""},{"$f":"IF(G$4=0,\"\",IF(Liste!G202=\"\",\"\",G$4/Liste!G$5*Liste!G202))","v":""},{"$f":"IF(H$4=0,\"\",IF(Liste!H202=\"\",\"\",H$4/Liste!H$5*Liste!H202))","v":""},{"$f":"IF(I$4=0,\"\",IF(Liste!I202=\"\",\"\",I$4/Liste!I$5*Liste!I202))","v":""},{"$f":"IF(J$4=0,\"\",IF(Liste!J202=\"\",\"\",J$4/Liste!J$5*Liste!J202))","v":""},{"$f":"IF(K$4=0,\"\",IF(Liste!K202=\"\",\"\",K$4/Liste!K$5*Liste!K202))","v":""},{"$f":"IF(L$4=0,\"\",IF(Liste!L202=\"\",\"\",L$4/Liste!L$5*Liste!L202))","v":""},{"$f":"IF(M$4=0,\"\",IF(Liste!M202=\"\",\"\",M$4/Liste!M$5*Liste!M202))","v":""},{"$f":"IF(N$4=0,\"\",IF(Liste!N202=\"\",\"\",N$4/Liste!N$5*Liste!N202))","v":""},{"$f":"IF(O$4=0,\"\",IF(Liste!O202=\"\",\"\",O$4/Liste!O$5*Liste!O202))","v":""},{"$f":"IF(P$4=0,\"\",IF(Liste!P202=\"\",\"\",P$4/Liste!P$5*Liste!P202))","v":""},{"$f":"IF(Q$4=0,\"\",IF(Liste!Q202=\"\",\"\",Q$4/Liste!Q$5*Liste!Q202))","v":""}]
["",{"$f":"IF(Liste!B203=\"\",\"\",Liste!B203)","v":""},{"$f":"IF(Liste!C203=\"\",\"\",Liste!C203)","v":""},{"$f":"IF(Liste!D203=\"\",\"\",Liste!D203)","v":""},{"$f":"IF(E$4=0,\"\",IF(Liste!E203=\"\",\"\",E$4/Liste!E$5*Liste!E203))","v":""},{"$f":"IF(F$4=0,\"\",IF(Liste!F203=\"\",\"\",F$4/Liste!F$5*Liste!F203))","v":""},{"$f":"IF(G$4=0,\"\",IF(Liste!G203=\"\",\"\",G$4/Liste!G$5*Liste!G203))","v":""},{"$f":"IF(H$4=0,\"\",IF(Liste!H203=\"\",\"\",H$4/Liste!H$5*Liste!H203))","v":""},{"$f":"IF(I$4=0,\"\",IF(Liste!I203=\"\",\"\",I$4/Liste!I$5*Liste!I203))","v":""},{"$f":"IF(J$4=0,\"\",IF(Liste!J203=\"\",\"\",J$4/Liste!J$5*Liste!J203))","v":""},{"$f":"IF(K$4=0,\"\",IF(Liste!K203=\"\",\"\",K$4/Liste!K$5*Liste!K203))","v":""},{"$f":"IF(L$4=0,\"\",IF(Liste!L203=\"\",\"\",L$4/Liste!L$5*Liste!L203))","v":""},{"$f":"IF(M$4=0,\"\",IF(Liste!M203=\"\",\"\",M$4/Liste!M$5*Liste!M203))","v":""},{"$f":"IF(N$4=0,\"\",IF(Liste!N203=\"\",\"\",N$4/Liste!N$5*Liste!N203))","v":""},{"$f":"IF(O$4=0,\"\",IF(Liste!O203=\"\",\"\",O$4/Liste!O$5*Liste!O203))","v":""},{"$f":"IF(P$4=0,\"\",IF(Liste!P203=\"\",\"\",P$4/Liste!P$5*Liste!P203))","v":""},{"$f":"IF(Q$4=0,\"\",IF(Liste!Q203=\"\",\"\",Q$4/Liste!Q$5*Liste!Q203))","v":""}]
["",{"$f":"IF(Liste!B204=\"\",\"\",Liste!B204)","v":""},{"$f":"IF(Liste!C204=\"\",\"\",Liste!C204)","v":""},{"$f":"IF(Liste!D204=\"\",\"\",Liste!D204)","v":""},{"$f":"IF(E$4=0,\"\",IF(Liste!E204=\"\",\"\",E$4/Liste!E$5*Liste!E204))","v":""},{"$f":"IF(F$4=0,\"\",IF(Liste!F204=\"\",\"\",F$4/Liste!F$5*Liste!F204))","v":""},{"$f":"IF(G$4=0,\"\",IF(Liste!G204=\"\",\"\",G$4/Liste!G$5*Liste!G204))","v":""},{"$f":"IF(H$4=0,\"\",IF(Liste!H204=\"\",\"\",H$4/Liste!H$5*Liste!H204))","v":""},{"$f":"IF(I$4=0,\"\",IF(Liste!I204=\"\",\"\",I$4/Liste!I$5*Liste!I204))","v":""},{"$f":"IF(J$4=0,\"\",IF(Liste!J204=\"\",\"\",J$4/Liste!J$5*Liste!J204))","v":""},{"$f":"IF(K$4=0,\"\",IF(Liste!K204=\"\",\"\",K$4/Liste!K$5*Liste!K204))","v":""},{"$f":"IF(L$4=0,\"\",IF(Liste!L204=\"\",\"\",L$4/Liste!L$5*Liste!L204))","v":""},{"$f":"IF(M$4=0,\"\",IF(Liste!M204=\"\",\"\",M$4/Liste!M$5*Liste!M204))","v":""},{"$f":"IF(N$4=0,\"\",IF(Liste!N204=\"\",\"\",N$4/Liste!N$5*Liste!N204))","v":""},{"$f":"IF(O$4=0,\"\",IF(Liste!O204=\"\",\"\",O$4/Liste!O$5*Liste!O204))","v":""},{"$f":"IF(P$4=0,\"\",IF(Liste!P204=\"\",\"\",P$4/Liste!P$5*Liste!P204))","v":""},{"$f":"IF(Q$4=0,\"\",IF(Liste!Q204=\"\",\"\",Q$4/Liste!Q$5*Liste!Q204))","v":""}]
[{"$f":"IF(SUM(E200:H200)=0,\"\",SUM(E200:H200))","v":""},{"$f":"IF(Liste!B205=\"\",\"\",Liste!B205)","v":""},{"$f":"IF(Liste!C205=\"\",\"\",Liste!C205)","v":""},{"$f":"IF(Liste!D205=\"\",\"\",Liste!D205)","v":""},{"$f":"IF(E$4=0,\"\",IF(Liste!E205=\"\",\"\",E$4/Liste!E$5*Liste!E205))","v":""},{"$f":"IF(F$4=0,\"\",IF(Liste!F205=\"\",\"\",F$4/Liste!F$5*Liste!F205))","v":""},{"$f":"IF(G$4=0,\"\",IF(Liste!G205=\"\",\"\",G$4/Liste!G$5*Liste!G205))","v":""},{"$f":"IF(H$4=0,\"\",IF(Liste!H205=\"\",\"\",H$4/Liste!H$5*Liste!H205))","v":""},{"$f":"IF(I$4=0,\"\",IF(Liste!I205=\"\",\"\",I$4/Liste!I$5*Liste!I205))","v":""},{"$f":"IF(J$4=0,\"\",IF(Liste!J205=\"\",\"\",J$4/Liste!J$5*Liste!J205))","v":""},{"$f":"IF(K$4=0,\"\",IF(Liste!K205=\"\",\"\",K$4/Liste!K$5*Liste!K205))","v":""},{"$f":"IF(L$4=0,\"\",IF(Liste!L205=\"\",\"\",L$4/Liste!L$5*Liste!L205))","v":""},{"$f":"IF(M$4=0,\"\",IF(Liste!M205=\"\",\"\",M$4/Liste!M$5*Liste!M205))","v":""},{"$f":"IF(N$4=0,\"\",IF(Liste!N205=\"\",\"\",N$4/Liste!N$5*Liste!N205))","v":""},{"$f":"IF(O$4=0,\"\",IF(Liste!O205=\"\",\"\",O$4/Liste!O$5*Liste!O205))","v":""},{"$f":"IF(P$4=0,\"\",IF(Liste!P205=\"\",\"\",P$4/Liste!P$5*Liste!P205))","v":""},{"$f":"IF(Q$4=0,\"\",IF(Liste!Q205=\"\",\"\",Q$4/Liste!Q$5*Liste!Q205))","v":""}]
["",{"$f":"IF(Liste!B206=\"\",\"\",Liste!B206)","v":""},{"$f":"IF(Liste!C206=\"\",\"\",Liste!C206)","v":""},{"$f":"IF(Liste!D206=\"\",\"\",Liste!D206)","v":""},{"$f":"IF(E$4=0,\"\",IF(Liste!E206=\"\",\"\",E$4/Liste!E$5*Liste!E206))","v":""},{"$f":"IF(F$4=0,\"\",IF(Liste!F206=\"\",\"\",F$4/Liste!F$5*Liste!F206))","v":""},{"$f":"IF(G$4=0,\"\",IF(Liste!G206=\"\",\"\",G$4/Liste!G$5*Liste!G206))","v":""},{"$f":"IF(H$4=0,\"\",IF(Liste!H206=\"\",\"\",H$4/Liste!H$5*Liste!H206))","v":""},{"$f":"IF(I$4=0,\"\",IF(Liste!I206=\"\",\"\",I$4/Liste!I$5*Liste!I206))","v":""},{"$f":"IF(J$4=0,\"\",IF(Liste!J206=\"\",\"\",J$4/Liste!J$5*Liste!J206))","v":""},{"$f":"IF(K$4=0,\"\",IF(Liste!K206=\"\",\"\",K$4/Liste!K$5*Liste!K206))","v":""},{"$f":"IF(L$4=0,\"\",IF(Liste!L206=\"\",\"\",L$4/Liste!L$5*Liste!L206))","v":""},{"$f":"IF(M$4=0,\"\",IF(Liste!M206=\"\",\"\",M$4/Liste!M$5*Liste!M206))","v":""},{"$f":"IF(N$4=0,\"\",IF(Liste!N206=\"\",\"\",N$4/Liste!N$5*Liste!N206))","v":""},{"$f":"IF(O$4=0,\"\",IF(Liste!O206=\"\",\"\",O$4/Liste!O$5*Liste!O206))","v":""},{"$f":"IF(P$4=0,\"\",IF(Liste!P206=\"\",\"\",P$4/Liste!P$5*Liste!P206))","v":""},{"$f":"IF(Q$4=0,\"\",IF(Liste!Q206=\"\",\"\",Q$4/Liste!Q$5*Liste!Q206))","v":""}]
["",{"$f":"IF(Liste!B207=\"\",\"\",Liste!B207)","v":""},{"$f":"IF(Liste!C207=\"\",\"\",Liste!C207)","v":""},{"$f":"IF(Liste!D207=\"\",\"\",Liste!D207)","v":""},{"$f":"IF(E$4=0,\"\",IF(Liste!E207=\"\",\"\",E$4/Liste!E$5*Liste!E207))","v":""},{"$f":"IF(F$4=0,\"\",IF(Liste!F207=\"\",\"\",F$4/Liste!F$5*Liste!F207))","v":""},{"$f":"IF(G$4=0,\"\",IF(Liste!G207=\"\",\"\",G$4/Liste!G$5*Liste!G207))","v":""},{"$f":"IF(H$4=0,\"\",IF(Liste!H207=\"\",\"\",H$4/Liste!H$5*Liste!H207))","v":""},{"$f":"IF(I$4=0,\"\",IF(Liste!I207=\"\",\"\",I$4/Liste!I$5*Liste!I207))","v":""},{"$f":"IF(J$4=0,\"\",IF(Liste!J207=\"\",\"\",J$4/Liste!J$5*Liste!J207))","v":""},{"$f":"IF(K$4=0,\"\",IF(Liste!K207=\"\",\"\",K$4/Liste!K$5*Liste!K207))","v":""},{"$f":"IF(L$4=0,\"\",IF(Liste!L207=\"\",\"\",L$4/Liste!L$5*Liste!L207))","v":""},{"$f":"IF(M$4=0,\"\",IF(Liste!M207=\"\",\"\",M$4/Liste!M$5*Liste!M207))","v":""},{"$f":"IF(N$4=0,\"\",IF(Liste!N207=\"\",\"\",N$4/Liste!N$5*Liste!N207))","v":""},{"$f":"IF(O$4=0,\"\",IF(Liste!O207=\"\",\"\",O$4/Liste!O$5*Liste!O207))","v":""},{"$f":"IF(P$4=0,\"\",IF(Liste!P207=\"\",\"\",P$4/Liste!P$5*Liste!P207))","v":""},{"$f":"IF(Q$4=0,\"\",IF(Liste!Q207=\"\",\"\",Q$4/Liste!Q$5*Liste!Q207))","v":""}]
["",{"$f":"IF(Liste!B208=\"\",\"\",Liste!B208)","v":""},{"$f":"IF(Liste!C208=\"\",\"\",Liste!C208)","v":""},{"$f":"IF(Liste!D208=\"\",\"\",Liste!D208)","v":""},{"$f":"IF(E$4=0,\"\",IF(Liste!E208=\"\",\"\",E$4/Liste!E$5*Liste!E208))","v":""},{"$f":"IF(F$4=0,\"\",IF(Liste!F208=\"\",\"\",F$4/Liste!F$5*Liste!F208))","v":""},{"$f":"IF(G$4=0,\"\",IF(Liste!G208=\"\",\"\",G$4/Liste!G$5*Liste!G208))","v":""},{"$f":"IF(H$4=0,\"\",IF(Liste!H208=\"\",\"\",H$4/Liste!H$5*Liste!H208))","v":""},{"$f":"IF(I$4=0,\"\",IF(Liste!I208=\"\",\"\",I$4/Liste!I$5*Liste!I208))","v":""},{"$f":"IF(J$4=0,\"\",IF(Liste!J208=\"\",\"\",J$4/Liste!J$5*Liste!J208))","v":""},{"$f":"IF(K$4=0,\"\",IF(Liste!K208=\"\",\"\",K$4/Liste!K$5*Liste!K208))","v":""},{"$f":"IF(L$4=0,\"\",IF(Liste!L208=\"\",\"\",L$4/Liste!L$5*Liste!L208))","v":""},{"$f":"IF(M$4=0,\"\",IF(Liste!M208=\"\",\"\",M$4/Liste!M$5*Liste!M208))","v":""},{"$f":"IF(N$4=0,\"\",IF(Liste!N208=\"\",\"\",N$4/Liste!N$5*Liste!N208))","v":""},{"$f":"IF(O$4=0,\"\",IF(Liste!O208=\"\",\"\",O$4/Liste!O$5*Liste!O208))","v":""},{"$f":"IF(P$4=0,\"\",IF(Liste!P208=\"\",\"\",P$4/Liste!P$5*Liste!P208))","v":""},{"$f":"IF(Q$4=0,\"\",IF(Liste!Q208=\"\",\"\",Q$4/Liste!Q$5*Liste!Q208))","v":""}]
["",{"$f":"IF(Liste!B209=\"\",\"\",Liste!B209)","v":""},{"$f":"IF(Liste!C209=\"\",\"\",Liste!C209)","v":""},{"$f":"IF(Liste!D209=\"\",\"\",Liste!D209)","v":""},{"$f":"IF(E$4=0,\"\",IF(Liste!E209=\"\",\"\",E$4/Liste!E$5*Liste!E209))","v":""},{"$f":"IF(F$4=0,\"\",IF(Liste!F209=\"\",\"\",F$4/Liste!F$5*Liste!F209))","v":""},{"$f":"IF(G$4=0,\"\",IF(Liste!G209=\"\",\"\",G$4/Liste!G$5*Liste!G209))","v":""},{"$f":"IF(H$4=0,\"\",IF(Liste!H209=\"\",\"\",H$4/Liste!H$5*Liste!H209))","v":""},{"$f":"IF(I$4=0,\"\",IF(Liste!I209=\"\",\"\",I$4/Liste!I$5*Liste!I209))","v":""},{"$f":"IF(J$4=0,\"\",IF(Liste!J209=\"\",\"\",J$4/Liste!J$5*Liste!J209))","v":""},{"$f":"IF(K$4=0,\"\",IF(Liste!K209=\"\",\"\",K$4/Liste!K$5*Liste!K209))","v":""},{"$f":"IF(L$4=0,\"\",IF(Liste!L209=\"\",\"\",L$4/Liste!L$5*Liste!L209))","v":""},{"$f":"IF(M$4=0,\"\",IF(Liste!M209=\"\",\"\",M$4/Liste!M$5*Liste!M209))","v":""},{"$f":"IF(N$4=0,\"\",IF(Liste!N209=\"\",\"\",N$4/Liste!N$5*Liste!N209))","v":""},{"$f":"IF(O$4=0,\"\",IF(Liste!O209=\"\",\"\",O$4/Liste!O$5*Liste!O209))","v":""},{"$f":"IF(P$4=0,\"\",IF(Liste!P209=\"\",\"\",P$4/Liste!P$5*Liste!P209))","v":""},{"$f":"IF(Q$4=0,\"\",IF(Liste!Q209=\"\",\"\",Q$4/Liste!Q$5*Liste!Q209))","v":""}]
["",{"$f":"IF(Liste!B210=\"\",\"\",Liste!B210)","v":""},{"$f":"IF(Liste!C210=\"\",\"\",Liste!C210)","v":""},{"$f":"IF(Liste!D210=\"\",\"\",Liste!D210)","v":""},{"$f":"IF(E$4=0,\"\",IF(Liste!E210=\"\",\"\",E$4/Liste!E$5*Liste!E210))","v":""},{"$f":"IF(F$4=0,\"\",IF(Liste!F210=\"\",\"\",F$4/Liste!F$5*Liste!F210))","v":""},{"$f":"IF(G$4=0,\"\",IF(Liste!G210=\"\",\"\",G$4/Liste!G$5*Liste!G210))","v":""},{"$f":"IF(H$4=0,\"\",IF(Liste!H210=\"\",\"\",H$4/Liste!H$5*Liste!H210))","v":""},{"$f":"IF(I$4=0,\"\",IF(Liste!I210=\"\",\"\",I$4/Liste!I$5*Liste!I210))","v":""},{"$f":"IF(J$4=0,\"\",IF(Liste!J210=\"\",\"\",J$4/Liste!J$5*Liste!J210))","v":""},{"$f":"IF(K$4=0,\"\",IF(Liste!K210=\"\",\"\",K$4/Liste!K$5*Liste!K210))","v":""},{"$f":"IF(L$4=0,\"\",IF(Liste!L210=\"\",\"\",L$4/Liste!L$5*Liste!L210))","v":""},{"$f":"IF(M$4=0,\"\",IF(Liste!M210=\"\",\"\",M$4/Liste!M$5*Liste!M210))","v":""},{"$f":"IF(N$4=0,\"\",IF(Liste!N210=\"\",\"\",N$4/Liste!N$5*Liste!N210))","v":""},{"$f":"IF(O$4=0,\"\",IF(Liste!O210=\"\",\"\",O$4/Liste!O$5*Liste!O210))","v":""},{"$f":"IF(P$4=0,\"\",IF(Liste!P210=\"\",\"\",P$4/Liste!P$5*Liste!P210))","v":""},{"$f":"IF(Q$4=0,\"\",IF(Liste!Q210=\"\",\"\",Q$4/Liste!Q$5*Liste!Q210))","v":""}]
["",{"$f":"IF(Liste!B211=\"\",\"\",Liste!B211)","v":""},{"$f":"IF(Liste!C211=\"\",\"\",Liste!C211)","v":""},{"$f":"IF(Liste!D211=\"\",\"\",Liste!D211)","v":""},{"$f":"IF(E$4=0,\"\",IF(Liste!E211=\"\",\"\",E$4/Liste!E$5*Liste!E211))","v":""},{"$f":"IF(F$4=0,\"\",IF(Liste!F211=\"\",\"\",F$4/Liste!F$5*Liste!F211))","v":""},{"$f":"IF(G$4=0,\"\",IF(Liste!G211=\"\",\"\",G$4/Liste!G$5*Liste!G211))","v":""},{"$f":"IF(H$4=0,\"\",IF(Liste!H211=\"\",\"\",H$4/Liste!H$5*Liste!H211))","v":""},{"$f":"IF(I$4=0,\"\",IF(Liste!I211=\"\",\"\",I$4/Liste!I$5*Liste!I211))","v":""},{"$f":"IF(J$4=0,\"\",IF(Liste!J211=\"\",\"\",J$4/Liste!J$5*Liste!J211))","v":""},{"$f":"IF(K$4=0,\"\",IF(Liste!K211=\"\",\"\",K$4/Liste!K$5*Liste!K211))","v":""},{"$f":"IF(L$4=0,\"\",IF(Liste!L211=\"\",\"\",L$4/Liste!L$5*Liste!L211))","v":""},{"$f":"IF(M$4=0,\"\",IF(Liste!M211=\"\",\"\",M$4/Liste!M$5*Liste!M211))","v":""},{"$f":"IF(N$4=0,\"\",IF(Liste!N211=\"\",\"\",N$4/Liste!N$5*Liste!N211))","v":""},{"$f":"IF(O$4=0,\"\",IF(Liste!O211=\"\",\"\",O$4/Liste!O$5*Liste!O211))","v":""},{"$f":"IF(P$4=0,\"\",IF(Liste!P211=\"\",\"\",P$4/Liste!P$5*Liste!P211))","v":""},{"$f":"IF(Q$4=0,\"\",IF(Liste!Q211=\"\",\"\",Q$4/Liste!Q$5*Liste!Q211))","v":""}]
["",{"$f":"IF(Liste!B212=\"\",\"\",Liste!B212)","v":""},{"$f":"IF(Liste!C212=\"\",\"\",Liste!C212)","v":""},{"$f":"IF(Liste!D212=\"\",\"\",Liste!D212)","v":""},{"$f":"IF(E$4=0,\"\",IF(Liste!E212=\"\",\"\",E$4/Liste!E$5*Liste!E212))","v":""},{"$f":"IF(F$4=0,\"\",IF(Liste!F212=\"\",\"\",F$4/Liste!F$5*Liste!F212))","v":""},{"$f":"IF(G$4=0,\"\",IF(Liste!G212=\"\",\"\",G$4/Liste!G$5*Liste!G212))","v":""},{"$f":"IF(H$4=0,\"\",IF(Liste!H212=\"\",\"\",H$4/Liste!H$5*Liste!H212))","v":""},{"$f":"IF(I$4=0,\"\",IF(Liste!I212=\"\",\"\",I$4/Liste!I$5*Liste!I212))","v":""},{"$f":"IF(J$4=0,\"\",IF(Liste!J212=\"\",\"\",J$4/Liste!J$5*Liste!J212))","v":""},{"$f":"IF(K$4=0,\"\",IF(Liste!K212=\"\",\"\",K$4/Liste!K$5*Liste!K212))","v":""},{"$f":"IF(L$4=0,\"\",IF(Liste!L212=\"\",\"\",L$4/Liste!L$5*Liste!L212))","v":""},{"$f":"IF(M$4=0,\"\",IF(Liste!M212=\"\",\"\",M$4/Liste!M$5*Liste!M212))","v":""},{"$f":"IF(N$4=0,\"\",IF(Liste!N212=\"\",\"\",N$4/Liste!N$5*Liste!N212))","v":""},{"$f":"IF(O$4=0,\"\",IF(Liste!O212=\"\",\"\",O$4/Liste!O$5*Liste!O212))","v":""},{"$f":"IF(P$4=0,\"\",IF(Liste!P212=\"\",\"\",P$4/Liste!P$5*Liste!P212))","v":""},{"$f":"IF(Q$4=0,\"\",IF(Liste!Q212=\"\",\"\",Q$4/Liste!Q$5*Liste!Q212))","v":""}]
["",{"$f":"IF(Liste!B213=\"\",\"\",Liste!B213)","v":""},{"$f":"IF(Liste!C213=\"\",\"\",Liste!C213)","v":""},{"$f":"IF(Liste!D213=\"\",\"\",Liste!D213)","v":""},{"$f":"IF(E$4=0,\"\",IF(Liste!E213=\"\",\"\",E$4/Liste!E$5*Liste!E213))","v":""},{"$f":"IF(F$4=0,\"\",IF(Liste!F213=\"\",\"\",F$4/Liste!F$5*Liste!F213))","v":""},{"$f":"IF(G$4=0,\"\",IF(Liste!G213=\"\",\"\",G$4/Liste!G$5*Liste!G213))","v":""},{"$f":"IF(H$4=0,\"\",IF(Liste!H213=\"\",\"\",H$4/Liste!H$5*Liste!H213))","v":""},{"$f":"IF(I$4=0,\"\",IF(Liste!I213=\"\",\"\",I$4/Liste!I$5*Liste!I213))","v":""},{"$f":"IF(J$4=0,\"\",IF(Liste!J213=\"\",\"\",J$4/Liste!J$5*Liste!J213))","v":""},{"$f":"IF(K$4=0,\"\",IF(Liste!K213=\"\",\"\",K$4/Liste!K$5*Liste!K213))","v":""},{"$f":"IF(L$4=0,\"\",IF(Liste!L213=\"\",\"\",L$4/Liste!L$5*Liste!L213))","v":""},{"$f":"IF(M$4=0,\"\",IF(Liste!M213=\"\",\"\",M$4/Liste!M$5*Liste!M213))","v":""},{"$f":"IF(N$4=0,\"\",IF(Liste!N213=\"\",\"\",N$4/Liste!N$5*Liste!N213))","v":""},{"$f":"IF(O$4=0,\"\",IF(Liste!O213=\"\",\"\",O$4/Liste!O$5*Liste!O213))","v":""},{"$f":"IF(P$4=0,\"\",IF(Liste!P213=\"\",\"\",P$4/Liste!P$5*Liste!P213))","v":""},{"$f":"IF(Q$4=0,\"\",IF(Liste!Q213=\"\",\"\",Q$4/Liste!Q$5*Liste!Q213))","v":""}]
["",{"$f":"IF(Liste!B214=\"\",\"\",Liste!B214)","v":""},{"$f":"IF(Liste!C214=\"\",\"\",Liste!C214)","v":""},{"$f":"IF(Liste!D214=\"\",\"\",Liste!D214)","v":""},{"$f":"IF(E$4=0,\"\",IF(Liste!E214=\"\",\"\",E$4/Liste!E$5*Liste!E214))","v":""},{"$f":"IF(F$4=0,\"\",IF(Liste!F214=\"\",\"\",F$4/Liste!F$5*Liste!F214))","v":""},{"$f":"IF(G$4=0,\"\",IF(Liste!G214=\"\",\"\",G$4/Liste!G$5*Liste!G214))","v":""},{"$f":"IF(H$4=0,\"\",IF(Liste!H214=\"\",\"\",H$4/Liste!H$5*Liste!H214))","v":""},{"$f":"IF(I$4=0,\"\",IF(Liste!I214=\"\",\"\",I$4/Liste!I$5*Liste!I214))","v":""},{"$f":"IF(J$4=0,\"\",IF(Liste!J214=\"\",\"\",J$4/Liste!J$5*Liste!J214))","v":""},{"$f":"IF(K$4=0,\"\",IF(Liste!K214=\"\",\"\",K$4/Liste!K$5*Liste!K214))","v":""},{"$f":"IF(L$4=0,\"\",IF(Liste!L214=\"\",\"\",L$4/Liste!L$5*Liste!L214))","v":""},{"$f":"IF(M$4=0,\"\",IF(Liste!M214=\"\",\"\",M$4/Liste!M$5*Liste!M214))","v":""},{"$f":"IF(N$4=0,\"\",IF(Liste!N214=\"\",\"\",N$4/Liste!N$5*Liste!N214))","v":""},{"$f":"IF(O$4=0,\"\",IF(Liste!O214=\"\",\"\",O$4/Liste!O$5*Liste!O214))","v":""},{"$f":"IF(P$4=0,\"\",IF(Liste!P214=\"\",\"\",P$4/Liste!P$5*Liste!P214))","v":""},{"$f":"IF(Q$4=0,\"\",IF(Liste!Q214=\"\",\"\",Q$4/Liste!Q$5*Liste!Q214))","v":""}]
["",{"$f":"IF(Liste!B215=\"\",\"\",Liste!B215)","v":""},{"$f":"IF(Liste!C215=\"\",\"\",Liste!C215)","v":""},{"$f":"IF(Liste!D215=\"\",\"\",Liste!D215)","v":""},{"$f":"IF(E$4=0,\"\",IF(Liste!E215=\"\",\"\",E$4/Liste!E$5*Liste!E215))","v":""},{"$f":"IF(F$4=0,\"\",IF(Liste!F215=\"\",\"\",F$4/Liste!F$5*Liste!F215))","v":""},{"$f":"IF(G$4=0,\"\",IF(Liste!G215=\"\",\"\",G$4/Liste!G$5*Liste!G215))","v":""},{"$f":"IF(H$4=0,\"\",IF(Liste!H215=\"\",\"\",H$4/Liste!H$5*Liste!H215))","v":""},{"$f":"IF(I$4=0,\"\",IF(Liste!I215=\"\",\"\",I$4/Liste!I$5*Liste!I215))","v":""},{"$f":"IF(J$4=0,\"\",IF(Liste!J215=\"\",\"\",J$4/Liste!J$5*Liste!J215))","v":""},{"$f":"IF(K$4=0,\"\",IF(Liste!K215=\"\",\"\",K$4/Liste!K$5*Liste!K215))","v":""},{"$f":"IF(L$4=0,\"\",IF(Liste!L215=\"\",\"\",L$4/Liste!L$5*Liste!L215))","v":""},{"$f":"IF(M$4=0,\"\",IF(Liste!M215=\"\",\"\",M$4/Liste!M$5*Liste!M215))","v":""},{"$f":"IF(N$4=0,\"\",IF(Liste!N215=\"\",\"\",N$4/Liste!N$5*Liste!N215))","v":""},{"$f":"IF(O$4=0,\"\",IF(Liste!O215=\"\",\"\",O$4/Liste!O$5*Liste!O215))","v":""},{"$f":"IF(P$4=0,\"\",IF(Liste!P215=\"\",\"\",P$4/Liste!P$5*Liste!P215))","v":""},{"$f":"IF(Q$4=0,\"\",IF(Liste!Q215=\"\",\"\",Q$4/Liste!Q$5*Liste!Q215))","v":""}]
["",{"$f":"IF(Liste!B216=\"\",\"\",Liste!B216)","v":""},{"$f":"IF(Liste!C216=\"\",\"\",Liste!C216)","v":""},{"$f":"IF(Liste!D216=\"\",\"\",Liste!D216)","v":""},{"$f":"IF(E$4=0,\"\",IF(Liste!E216=\"\",\"\",E$4/Liste!E$5*Liste!E216))","v":""},{"$f":"IF(F$4=0,\"\",IF(Liste!F216=\"\",\"\",F$4/Liste!F$5*Liste!F216))","v":""},{"$f":"IF(G$4=0,\"\",IF(Liste!G216=\"\",\"\",G$4/Liste!G$5*Liste!G216))","v":""},{"$f":"IF(H$4=0,\"\",IF(Liste!H216=\"\",\"\",H$4/Liste!H$5*Liste!H216))","v":""},{"$f":"IF(I$4=0,\"\",IF(Liste!I216=\"\",\"\",I$4/Liste!I$5*Liste!I216))","v":""},{"$f":"IF(J$4=0,\"\",IF(Liste!J216=\"\",\"\",J$4/Liste!J$5*Liste!J216))","v":""},{"$f":"IF(K$4=0,\"\",IF(Liste!K216=\"\",\"\",K$4/Liste!K$5*Liste!K216))","v":""},{"$f":"IF(L$4=0,\"\",IF(Liste!L216=\"\",\"\",L$4/Liste!L$5*Liste!L216))","v":""},{"$f":"IF(M$4=0,\"\",IF(Liste!M216=\"\",\"\",M$4/Liste!M$5*Liste!M216))","v":""},{"$f":"IF(N$4=0,\"\",IF(Liste!N216=\"\",\"\",N$4/Liste!N$5*Liste!N216))","v":""},{"$f":"IF(O$4=0,\"\",IF(Liste!O216=\"\",\"\",O$4/Liste!O$5*Liste!O216))","v":""},{"$f":"IF(P$4=0,\"\",IF(Liste!P216=\"\",\"\",P$4/Liste!P$5*Liste!P216))","v":""},{"$f":"IF(Q$4=0,\"\",IF(Liste!Q216=\"\",\"\",Q$4/Liste!Q$5*Liste!Q216))","v":""}]
["",{"$f":"IF(Liste!B217=\"\",\"\",Liste!B217)","v":""},{"$f":"IF(Liste!C217=\"\",\"\",Liste!C217)","v":""},{"$f":"IF(Liste!D217=\"\",\"\",Liste!D217)","v":""},{"$f":"IF(E$4=0,\"\",IF(Liste!E217=\"\",\"\",E$4/Liste!E$5*Liste!E217))","v":""},{"$f":"IF(F$4=0,\"\",IF(Liste!F217=\"\",\"\",F$4/Liste!F$5*Liste!F217))","v":""},{"$f":"IF(G$4=0,\"\",IF(Liste!G217=\"\",\"\",G$4/Liste!G$5*Liste!G217))","v":""},{"$f":"IF(H$4=0,\"\",IF(Liste!H217=\"\",\"\",H$4/Liste!H$5*Liste!H217))","v":""},{"$f":"IF(I$4=0,\"\",IF(Liste!I217=\"\",\"\",I$4/Liste!I$5*Liste!I217))","v":""},{"$f":"IF(J$4=0,\"\",IF(Liste!J217=\"\",\"\",J$4/Liste!J$5*Liste!J217))","v":""},{"$f":"IF(K$4=0,\"\",IF(Liste!K217=\"\",\"\",K$4/Liste!K$5*Liste!K217))","v":""},{"$f":"IF(L$4=0,\"\",IF(Liste!L217=\"\",\"\",L$4/Liste!L$5*Liste!L217))","v":""},{"$f":"IF(M$4=0,\"\",IF(Liste!M217=\"\",\"\",M$4/Liste!M$5*Liste!M217))","v":""},{"$f":"IF(N$4=0,\"\",IF(Liste!N217=\"\",\"\",N$4/Liste!N$5*Liste!N217))","v":""},{"$f":"IF(O$4=0,\"\",IF(Liste!O217=\"\",\"\",O$4/Liste!O$5*Liste!O217))","v":""},{"$f":"IF(P$4=0,\"\",IF(Liste!P217=\"\",\"\",P$4/Liste!P$5*Liste!P217))","v":""},{"$f":"IF(Q$4=0,\"\",IF(Liste!Q217=\"\",\"\",Q$4/Liste!Q$5*Liste!Q217))","v":""}]
["",{"$f":"IF(Liste!B218=\"\",\"\",Liste!B218)","v":""},{"$f":"IF(Liste!C218=\"\",\"\",Liste!C218)","v":""},{"$f":"IF(Liste!D218=\"\",\"\",Liste!D218)","v":""},{"$f":"IF(E$4=0,\"\",IF(Liste!E218=\"\",\"\",E$4/Liste!E$5*Liste!E218))","v":""},{"$f":"IF(F$4=0,\"\",IF(Liste!F218=\"\",\"\",F$4/Liste!F$5*Liste!F218))","v":""},{"$f":"IF(G$4=0,\"\",IF(Liste!G218=\"\",\"\",G$4/Liste!G$5*Liste!G218))","v":""},{"$f":"IF(H$4=0,\"\",IF(Liste!H218=\"\",\"\",H$4/Liste!H$5*Liste!H218))","v":""},{"$f":"IF(I$4=0,\"\",IF(Liste!I218=\"\",\"\",I$4/Liste!I$5*Liste!I218))","v":""},{"$f":"IF(J$4=0,\"\",IF(Liste!J218=\"\",\"\",J$4/Liste!J$5*Liste!J218))","v":""},{"$f":"IF(K$4=0,\"\",IF(Liste!K218=\"\",\"\",K$4/Liste!K$5*Liste!K218))","v":""},{"$f":"IF(L$4=0,\"\",IF(Liste!L218=\"\",\"\",L$4/Liste!L$5*Liste!L218))","v":""},{"$f":"IF(M$4=0,\"\",IF(Liste!M218=\"\",\"\",M$4/Liste!M$5*Liste!M218))","v":""},{"$f":"IF(N$4=0,\"\",IF(Liste!N218=\"\",\"\",N$4/Liste!N$5*Liste!N218))","v":""},{"$f":"IF(O$4=0,\"\",IF(Liste!O218=\"\",\"\",O$4/Liste!O$5*Liste!O218))","v":""},{"$f":"IF(P$4=0,\"\",IF(Liste!P218=\"\",\"\",P$4/Liste!P$5*Liste!P218))","v":""},{"$f":"IF(Q$4=0,\"\",IF(Liste!Q218=\"\",\"\",Q$4/Liste!Q$5*Liste!Q218))","v":""}]
["",{"$f":"IF(Liste!B219=\"\",\"\",Liste!B219)","v":""},{"$f":"IF(Liste!C219=\"\",\"\",Liste!C219)","v":""},{"$f":"IF(Liste!D219=\"\",\"\",Liste!D219)","v":""},{"$f":"IF(E$4=0,\"\",IF(Liste!E219=\"\",\"\",E$4/Liste!E$5*Liste!E219))","v":""},{"$f":"IF(F$4=0,\"\",IF(Liste!F219=\"\",\"\",F$4/Liste!F$5*Liste!F219))","v":""},{"$f":"IF(G$4=0,\"\",IF(Liste!G219=\"\",\"\",G$4/Liste!G$5*Liste!G219))","v":""},{"$f":"IF(H$4=0,\"\",IF(Liste!H219=\"\",\"\",H$4/Liste!H$5*Liste!H219))","v":""},{"$f":"IF(I$4=0,\"\",IF(Liste!I219=\"\",\"\",I$4/Liste!I$5*Liste!I219))","v":""},{"$f":"IF(J$4=0,\"\",IF(Liste!J219=\"\",\"\",J$4/Liste!J$5*Liste!J219))","v":""},{"$f":"IF(K$4=0,\"\",IF(Liste!K219=\"\",\"\",K$4/Liste!K$5*Liste!K219))","v":""},{"$f":"IF(L$4=0,\"\",IF(Liste!L219=\"\",\"\",L$4/Liste!L$5*Liste!L219))","v":""},{"$f":"IF(M$4=0,\"\",IF(Liste!M219=\"\",\"\",M$4/Liste!M$5*Liste!M219))","v":""},{"$f":"IF(N$4=0,\"\",IF(Liste!N219=\"\",\"\",N$4/Liste!N$5*Liste!N219))","v":""},{"$f":"IF(O$4=0,\"\",IF(Liste!O219=\"\",\"\",O$4/Liste!O$5*Liste!O219))","v":""},{"$f":"IF(P$4=0,\"\",IF(Liste!P219=\"\",\"\",P$4/Liste!P$5*Liste!P219))","v":""},{"$f":"IF(Q$4=0,\"\",IF(Liste!Q219=\"\",\"\",Q$4/Liste!Q$5*Liste!Q219))","v":""}]
["",{"$f":"IF(Liste!B220=\"\",\"\",Liste!B220)","v":""},{"$f":"IF(Liste!C220=\"\",\"\",Liste!C220)","v":""},{"$f":"IF(Liste!D220=\"\",\"\",Liste!D220)","v":""},{"$f":"IF(E$4=0,\"\",IF(Liste!E220=\"\",\"\",E$4/Liste!E$5*Liste!E220))","v":""},{"$f":"IF(F$4=0,\"\",IF(Liste!F220=\"\",\"\",F$4/Liste!F$5*Liste!F220))","v":""},{"$f":"IF(G$4=0,\"\",IF(Liste!G220=\"\",\"\",G$4/Liste!G$5*Liste!G220))","v":""},{"$f":"IF(H$4=0,\"\",IF(Liste!H220=\"\",\"\",H$4/Liste!H$5*Liste!H220))","v":""},{"$f":"IF(I$4=0,\"\",IF(Liste!I220=\"\",\"\",I$4/Liste!I$5*Liste!I220))","v":""},{"$f":"IF(J$4=0,\"\",IF(Liste!J220=\"\",\"\",J$4/Liste!J$5*Liste!J220))","v":""},{"$f":"IF(K$4=0,\"\",IF(Liste!K220=\"\",\"\",K$4/Liste!K$5*Liste!K220))","v":""},{"$f":"IF(L$4=0,\"\",IF(Liste!L220=\"\",\"\",L$4/Liste!L$5*Liste!L220))","v":""},{"$f":"IF(M$4=0,\"\",IF(Liste!M220=\"\",\"\",M$4/Liste!M$5*Liste!M220))","v":""},{"$f":"IF(N$4=0,\"\",IF(Liste!N220=\"\",\"\",N$4/Liste!N$5*Liste!N220))","v":""},{"$f":"IF(O$4=0,\"\",IF(Liste!O220=\"\",\"\",O$4/Liste!O$5*Liste!O220))","v":""},{"$f":"IF(P$4=0,\"\",IF(Liste!P220=\"\",\"\",P$4/Liste!P$5*Liste!P220))","v":""},{"$f":"IF(Q$4=0,\"\",IF(Liste!Q220=\"\",\"\",Q$4/Liste!Q$5*Liste!Q220))","v":""}]
["",{"$f":"IF(Liste!B221=\"\",\"\",Liste!B221)","v":""},{"$f":"IF(Liste!C221=\"\",\"\",Liste!C221)","v":""},{"$f":"IF(Liste!D221=\"\",\"\",Liste!D221)","v":""},{"$f":"IF(E$4=0,\"\",IF(Liste!E221=\"\",\"\",E$4/Liste!E$5*Liste!E221))","v":""},{"$f":"IF(F$4=0,\"\",IF(Liste!F221=\"\",\"\",F$4/Liste!F$5*Liste!F221))","v":""},{"$f":"IF(G$4=0,\"\",IF(Liste!G221=\"\",\"\",G$4/Liste!G$5*Liste!G221))","v":""},{"$f":"IF(H$4=0,\"\",IF(Liste!H221=\"\",\"\",H$4/Liste!H$5*Liste!H221))","v":""},{"$f":"IF(I$4=0,\"\",IF(Liste!I221=\"\",\"\",I$4/Liste!I$5*Liste!I221))","v":""},{"$f":"IF(J$4=0,\"\",IF(Liste!J221=\"\",\"\",J$4/Liste!J$5*Liste!J221))","v":""},{"$f":"IF(K$4=0,\"\",IF(Liste!K221=\"\",\"\",K$4/Liste!K$5*Liste!K221))","v":""},{"$f":"IF(L$4=0,\"\",IF(Liste!L221=\"\",\"\",L$4/Liste!L$5*Liste!L221))","v":""},{"$f":"IF(M$4=0,\"\",IF(Liste!M221=\"\",\"\",M$4/Liste!M$5*Liste!M221))","v":""},{"$f":"IF(N$4=0,\"\",IF(Liste!N221=\"\",\"\",N$4/Liste!N$5*Liste!N221))","v":""},{"$f":"IF(O$4=0,\"\",IF(Liste!O221=\"\",\"\",O$4/Liste!O$5*Liste!O221))","v":""},{"$f":"IF(P$4=0,\"\",IF(Liste!P221=\"\",\"\",P$4/Liste!P$5*Liste!P221))","v":""},{"$f":"IF(Q$4=0,\"\",IF(Liste!Q221=\"\",\"\",Q$4/Liste!Q$5*Liste!Q221))","v":""}]
["",{"$f":"IF(Liste!B222=\"\",\"\",Liste!B222)","v":""},{"$f":"IF(Liste!C222=\"\",\"\",Liste!C222)","v":""},{"$f":"IF(Liste!D222=\"\",\"\",Liste!D222)","v":""},{"$f":"IF(E$4=0,\"\",IF(Liste!E222=\"\",\"\",E$4/Liste!E$5*Liste!E222))","v":""},{"$f":"IF(F$4=0,\"\",IF(Liste!F222=\"\",\"\",F$4/Liste!F$5*Liste!F222))","v":""},{"$f":"IF(G$4=0,\"\",IF(Liste!G222=\"\",\"\",G$4/Liste!G$5*Liste!G222))","v":""},{"$f":"IF(H$4=0,\"\",IF(Liste!H222=\"\",\"\",H$4/Liste!H$5*Liste!H222))","v":""},{"$f":"IF(I$4=0,\"\",IF(Liste!I222=\"\",\"\",I$4/Liste!I$5*Liste!I222))","v":""},{"$f":"IF(J$4=0,\"\",IF(Liste!J222=\"\",\"\",J$4/Liste!J$5*Liste!J222))","v":""},{"$f":"IF(K$4=0,\"\",IF(Liste!K222=\"\",\"\",K$4/Liste!K$5*Liste!K222))","v":""},{"$f":"IF(L$4=0,\"\",IF(Liste!L222=\"\",\"\",L$4/Liste!L$5*Liste!L222))","v":""},{"$f":"IF(M$4=0,\"\",IF(Liste!M222=\"\",\"\",M$4/Liste!M$5*Liste!M222))","v":""},{"$f":"IF(N$4=0,\"\",IF(Liste!N222=\"\",\"\",N$4/Liste!N$5*Liste!N222))","v":""},{"$f":"IF(O$4=0,\"\",IF(Liste!O222=\"\",\"\",O$4/Liste!O$5*Liste!O222))","v":""},{"$f":"IF(P$4=0,\"\",IF(Liste!P222=\"\",\"\",P$4/Liste!P$5*Liste!P222))","v":""},{"$f":"IF(Q$4=0,\"\",IF(Liste!Q222=\"\",\"\",Q$4/Liste!Q$5*Liste!Q222))","v":""}]
["",{"$f":"IF(Liste!B223=\"\",\"\",Liste!B223)","v":""},{"$f":"IF(Liste!C223=\"\",\"\",Liste!C223)","v":""},{"$f":"IF(Liste!D223=\"\",\"\",Liste!D223)","v":""},{"$f":"IF(E$4=0,\"\",IF(Liste!E223=\"\",\"\",E$4/Liste!E$5*Liste!E223))","v":""},{"$f":"IF(F$4=0,\"\",IF(Liste!F223=\"\",\"\",F$4/Liste!F$5*Liste!F223))","v":""},{"$f":"IF(G$4=0,\"\",IF(Liste!G223=\"\",\"\",G$4/Liste!G$5*Liste!G223))","v":""},{"$f":"IF(H$4=0,\"\",IF(Liste!H223=\"\",\"\",H$4/Liste!H$5*Liste!H223))","v":""},{"$f":"IF(I$4=0,\"\",IF(Liste!I223=\"\",\"\",I$4/Liste!I$5*Liste!I223))","v":""},{"$f":"IF(J$4=0,\"\",IF(Liste!J223=\"\",\"\",J$4/Liste!J$5*Liste!J223))","v":""},{"$f":"IF(K$4=0,\"\",IF(Liste!K223=\"\",\"\",K$4/Liste!K$5*Liste!K223))","v":""},{"$f":"IF(L$4=0,\"\",IF(Liste!L223=\"\",\"\",L$4/Liste!L$5*Liste!L223))","v":""},{"$f":"IF(M$4=0,\"\",IF(Liste!M223=\"\",\"\",M$4/Liste!M$5*Liste!M223))","v":""},{"$f":"IF(N$4=0,\"\",IF(Liste!N223=\"\",\"\",N$4/Liste!N$5*Liste!N223))","v":""},{"$f":"IF(O$4=0,\"\",IF(Liste!O223=\"\",\"\",O$4/Liste!O$5*Liste!O223))","v":""},{"$f":"IF(P$4=0,\"\",IF(Liste!P223=\"\",\"\",P$4/Liste!P$5*Liste!P223))","v":""},{"$f":"IF(Q$4=0,\"\",IF(Liste!Q223=\"\",\"\",Q$4/Liste!Q$5*Liste!Q223))","v":""}]
["",{"$f":"IF(Liste!B224=\"\",\"\",Liste!B224)","v":""},{"$f":"IF(Liste!C224=\"\",\"\",Liste!C224)","v":""},{"$f":"IF(Liste!D224=\"\",\"\",Liste!D224)","v":""},{"$f":"IF(E$4=0,\"\",IF(Liste!E224=\"\",\"\",E$4/Liste!E$5*Liste!E224))","v":""},{"$f":"IF(F$4=0,\"\",IF(Liste!F224=\"\",\"\",F$4/Liste!F$5*Liste!F224))","v":""},{"$f":"IF(G$4=0,\"\",IF(Liste!G224=\"\",\"\",G$4/Liste!G$5*Liste!G224))","v":""},{"$f":"IF(H$4=0,\"\",IF(Liste!H224=\"\",\"\",H$4/Liste!H$5*Liste!H224))","v":""},{"$f":"IF(I$4=0,\"\",IF(Liste!I224=\"\",\"\",I$4/Liste!I$5*Liste!I224))","v":""},{"$f":"IF(J$4=0,\"\",IF(Liste!J224=\"\",\"\",J$4/Liste!J$5*Liste!J224))","v":""},{"$f":"IF(K$4=0,\"\",IF(Liste!K224=\"\",\"\",K$4/Liste!K$5*Liste!K224))","v":""},{"$f":"IF(L$4=0,\"\",IF(Liste!L224=\"\",\"\",L$4/Liste!L$5*Liste!L224))","v":""},{"$f":"IF(M$4=0,\"\",IF(Liste!M224=\"\",\"\",M$4/Liste!M$5*Liste!M224))","v":""},{"$f":"IF(N$4=0,\"\",IF(Liste!N224=\"\",\"\",N$4/Liste!N$5*Liste!N224))","v":""},{"$f":"IF(O$4=0,\"\",IF(Liste!O224=\"\",\"\",O$4/Liste!O$5*Liste!O224))","v":""},{"$f":"IF(P$4=0,\"\",IF(Liste!P224=\"\",\"\",P$4/Liste!P$5*Liste!P224))","v":""},{"$f":"IF(Q$4=0,\"\",IF(Liste!Q224=\"\",\"\",Q$4/Liste!Q$5*Liste!Q224))","v":""}]
["",{"$f":"IF(Liste!B225=\"\",\"\",Liste!B225)","v":""},{"$f":"IF(Liste!C225=\"\",\"\",Liste!C225)","v":""},{"$f":"IF(Liste!D225=\"\",\"\",Liste!D225)","v":""},{"$f":"IF(E$4=0,\"\",IF(Liste!E225=\"\",\"\",E$4/Liste!E$5*Liste!E225))","v":""},{"$f":"IF(F$4=0,\"\",IF(Liste!F225=\"\",\"\",F$4/Liste!F$5*Liste!F225))","v":""},{"$f":"IF(G$4=0,\"\",IF(Liste!G225=\"\",\"\",G$4/Liste!G$5*Liste!G225))","v":""},{"$f":"IF(H$4=0,\"\",IF(Liste!H225=\"\",\"\",H$4/Liste!H$5*Liste!H225))","v":""},{"$f":"IF(I$4=0,\"\",IF(Liste!I225=\"\",\"\",I$4/Liste!I$5*Liste!I225))","v":""},{"$f":"IF(J$4=0,\"\",IF(Liste!J225=\"\",\"\",J$4/Liste!J$5*Liste!J225))","v":""},{"$f":"IF(K$4=0,\"\",IF(Liste!K225=\"\",\"\",K$4/Liste!K$5*Liste!K225))","v":""},{"$f":"IF(L$4=0,\"\",IF(Liste!L225=\"\",\"\",L$4/Liste!L$5*Liste!L225))","v":""},{"$f":"IF(M$4=0,\"\",IF(Liste!M225=\"\",\"\",M$4/Liste!M$5*Liste!M225))","v":""},{"$f":"IF(N$4=0,\"\",IF(Liste!N225=\"\",\"\",N$4/Liste!N$5*Liste!N225))","v":""},{"$f":"IF(O$4=0,\"\",IF(Liste!O225=\"\",\"\",O$4/Liste!O$5*Liste!O225))","v":""},{"$f":"IF(P$4=0,\"\",IF(Liste!P225=\"\",\"\",P$4/Liste!P$5*Liste!P225))","v":""},{"$f":"IF(Q$4=0,\"\",IF(Liste!Q225=\"\",\"\",Q$4/Liste!Q$5*Liste!Q225))","v":""}]
["",{"$f":"IF(Liste!B230=\"\",\"\",Liste!B230)","v":""},{"$f":"IF(Liste!C230=\"\",\"\",Liste!C230)","v":""},{"$f":"IF(Liste!D230=\"\",\"\",Liste!D230)","v":""}]
[""]
[""]
[""]
[""]
[""]
[""]
[""]
[""]
[""]
[""]
[""]
[""]
[""]
[""]
[""]
[""]
[""]
[""]
[""]
[""]
[""]
[""]
[""]
[""]
[""]
[""]
[""]
[""]
[""]
[""]
[""]
[""]
[""]
[""]
[""]
[""]
[""]
[""]
[""]
[""]
[""]
[""]
[{"$f":"IF(SUM(E264:H264)=0,\"\",SUM(E264:H264))","v":""}]
[""]
[""]
[""]
[""]
[""]
[""]
[""]
[""]
[""]
[""]
[""]
[""]
[""]
[""]
[""]
[""]
[""]
[""]
[""]
[""]
[""]
[""]
[""]
[""]
[""]
[""]
[""]
[""]
[""]
[""]
[""]
[""]
[""]
[""]
[""]
[""]

{"sheet":"Version","index":5,"n_rows":4,"n_cols":4,"rows_kept":4,"cut":false,"hidden":false,"merged":[[0,0,0,3]]}
["Bearbeitungen"]
["Version","Veränderung","Bemerkungen","Datum"]
["2.0","Deckblatt eingefügt",null,"2014-11-22"]
["2.01","Rezepte hinzugefügt",null,"2015-10-30"]

{"sheet":"11","index":6,"n_rows":57,"n_cols":8,"rows_kept":57,"cut":false,"hidden":false,"merged":[[32,2,32,7],[33,2,33,7],[34,2,34,7],[35,2,35,7],[2,4,2,7],[26,2,26,7],[27,2,27,7],[28,2,28,7],[30,2,30,7],[31,2,31,7]]}
[null,null,"zurück zur Auswahl"]
[]
[null,null,null,{"$f":"MID(CELL(\"dateiname\",A1),FIND(\"]\",CELL(\"dateiname\",A1))+1,255)","v":"11"},"Mandelplätzchen"]
[]
[null,null,null,null,"Zutaten für etwa 35 Stück:",null,null,"(Angabe in Gramm)"]
[]
[null,null,null,null,350,"g","Mehl"]
[null,null,null,null,1,"TL","Backpulver"]
[null,null,null,null,200,"g","Zucker"]
[null,null,null,null,150,"g","Speisestärke"]
[null,null,null,null,200,"g","Butter"]
[null,null,null,null,2,"St.","Eier"]
[null,null,null,null,2,"St.","Vanilleschoten"]
[null,null,null,null,70,"g","gehobelte Mandeln"]
[null,null,null,null,150,"g","Kuvertüre"]
[]
[]
[]
[]
[]
[]
[]
[]
[]
[]
[]
[null,1,"Butter schaumig schlagen. Zucker, Eier und Vanillemark nach und nach unterrühren."]
[null,null,"Mehl, Backpilver und Stärke mischen, darübersieben und unterkneten."]
[null,null,"In Frischhaltefolie 30 Minuten kühlen."]
[null,2,"Den Backofen auf 180 Grad (Umluft 160 Grad) vorheizen. Teig auf bemehlter Fläche"]
[null,null,"ca. 4 mm dick ausrollen und Kreis mit einerm Durchmesser von 5 cm ausstechen."]
[null,null,"Auf einem gefettetem Blech legen und ca. 10 min. backen."]
[null,3,"Kuvertüre hacken und in einem Wasserbad schmelzen und wieder etwas abkühlen"]
[null,null,"lassen. Die Hälfte der Plätzchen auf der glatten Seite damit bestreichen und je mit"]
[null,null,"einem unbestrichenem Plätzchen zusammensetzen. Jedes Plätzchen in die Kuvertüre"]
[null,null,"tauchen und abschließend mit den Mandeln bestreuen."]
[]
[]
[]
[]
[]
[]
[]
[]
[]
[]
[]
[]
[]
[null,null,"Backen:",180,"Ober- und Unterhitze"]
[null,null,null,160,"Umluft"]
[null,null,null,10,"Minuten"]
[]
[]
[]
[]
[null,null,null,null,null,null,null,"Quelle: LISA Kochen & Backen 11/2009"]

{"sheet":"12","index":7,"n_rows":57,"n_cols":8,"rows_kept":57,"cut":false,"hidden":false,"merged":[[32,2,32,7],[33,2,33,7],[34,2,34,7],[35,2,35,7],[2,4,2,7],[26,2,26,7],[27,2,27,7],[28,2,28,7],[30,2,30,7],[31,2,31,7]]}
[null,null,"zurück zur Auswahl"]
[]
[null,null,null,{"$f":"MID(CELL(\"dateiname\",A1),FIND(\"]\",CELL(\"dateiname\",A1))+1,255)","v":"12"},"Trüffelmakronen"]
[]
[null,null,null,null,"Zutaten für etwa 30 Stück:",null,null,"(Angabe in Gramm)"]
[]
[null,null,null,null,4,"St.","Eiweiß"]
[null,null,null,null,2,"TL","Zitronensaft"]
[null,null,null,null,250,"g","Puderzucker"]
[null,null,null,null,200,"g","gemahlene Mandeln"]
[null,null,null,null,3,"EL ","Kakaopulver"]
[null,null,null,null,150,"g","Zartbitterschokolade"]
[null,null,null,null,20,"g","Butter"]
[null,null,null,null,80,"g","Sahne"]
[]
[]
[]
[]
[]
[]
[]
[]
[]
[]
[]
[]
[null,1,"Eiweiß und Zirtonensaft steif schlagen. Dabei den Zucker einrieseln lassen. Mandeln und "]
[null,null,"2 TL Kakaopilver unterheben."]
[null,2,"Den Backofen auf 130 Grad (Umluft 110 Grad) vorheizen. Masse portionsweise in "]
[null,null,"Spritzbeutel im Lochtülle füllen und ca. 2 cm große Tupfen mit Abstand auf das Backpapier"]
[null,null,"spritzen. Makronen im Ofen ca. 40 min. backen. "]
[null,null,"Danach herausnehmen und abkühlen lassen."]
[null,3,"Schokolade hacken, im warmen Wasserbad schmelzen. Butter mit einem Schneebesen"]
[null,null,"unterrühren und abkühlen lassen."]
[null,null,"Sahne steif schlagen und unterheben."]
[null,null,"Jeweils 2 Kekse mit der Schokocreme zusammensetzen. Makronen mit Schablonen "]
[null,null,"belegen und mit dem übrigen Kakaopulver bestäuben."]
[]
[]
[]
[]
[]
[]
[]
[]
[]
[]
[]
[]
[null,null,"Backen:",130,"Ober- und Unterhitze"]
[null,null,null,110,"Umluft"]
[null,null,null,40,"Minuten"]
[]
[]
[]
[]
[null,null,null,null,null,null,null,"Quelle: LISA Kochen & Backen 12/2007"]

{"sheet":"14","index":8,"n_rows":57,"n_cols":8,"rows_kept":57,"cut":false,"hidden":false,"merged":[[32,2,32,7],[33,2,33,7],[34,2,34,7],[35,2,35,7],[2,4,2,7],[26,2,26,7],[27,2,27,7],[28,2,28,7],[30,2,30,7],[31,2,31,7]]}
[null,null,"zurück zur Auswahl"]
[]
[null,null,null,{"$f":"MID(CELL(\"dateiname\",A1),FIND(\"]\",CELL(\"dateiname\",A1))+1,255)","v":"14"},"Kokos-Kipferln"]
[]
[null,null,null,null,"Zutaten für etwa 50 Stück:",null,null,"(Angabe in Gramm)"]
[]
[null,null,null,null,225,"g","Mehl"]
[null,null,null,null,75,"g","Puderzucker"]
[null,null,null,null,200,"g","Zucker"]
[null,null,null,null,60,"g","Kokosraspeln"]
[null,null,null,null,200,"g","Butter"]
[null,null,null,null,1,"Pr.","Salz"]
[null,null,null,null,2,"St.","Vanilleschoten"]
[null,null,null,null,"1/2","St.","abger. Schale Zitrone"]
[null,null,null,null,3,"EL","Puderzucker"]
[null,null,null,null,3,"EL","Kokosraspeln"]
[]
[]
[]
[]
[]
[]
[]
[]
[]
[]
[null,1,"Kokosraspeln in einer Pfanne ohne Fettzugae leicht ansrösten und dannach wieder"]
[null,null,"abkühlen lassen. Butter klein schneiden und dann mit dem Puderzucker, Salz, der "]
[null,null,"Zitronenschale, den Vanillenmark, dem Mehl und den Kokosraspeln rasch zu einem"]
[null,null,"glatten Teig verkneten. Den Teig zu 3 Rollen von etwa 3 cm Durchmesser drehen und"]
[null,null,"in eine Frischhaltefolie wickeln und ca. für 2 Stunden in den Kühlschrank stellen."]
[null,2,"Den Backofen auf 180 Grad (160 Grad Umluft) vorheizen. Von den Teigrollen jeweils "]
[null,null,"1 cm dicke Scheiben abschneiden und diese zu Hörnchen formen."]
[null,null,"Die Scheiben auf dem mit Backpapier ausgelegten Blechen legen und im Ofen auf der"]
[null,null,"mittleren Schiene 10 bis 12 min. hell backen."]
[null,3,"Zum Garnieren Puderzucker auf einen Teller sieben und die Kokosraspeln dazugeben"]
[null,null,"und beides mischen. Die Kipferln vom Blech nehmen und noch warm in der Mischung"]
[null,null,"wälzen und danach auf ein Kuchengitter setzen und abkühlen lassen."]
[]
[]
[]
[]
[]
[]
[]
[]
[]
[]
[]
[null,null,"Backen:",180,"Ober- und Unterhitze"]
[null,null,null,160,"Umluft"]
[null,null,null,"10-12","Minuten"]
[]
[]
[]
[]
[null,null,null,null,null,null,null,"Quelle: LISA Kochen & Backen Spezial/2012"]

{"sheet":"17","index":9,"n_rows":57,"n_cols":8,"rows_kept":57,"cut":false,"hidden":false,"merged":[[32,2,32,7],[33,2,33,7],[34,2,34,7],[35,2,35,7],[2,4,2,7],[26,2,26,7],[27,2,27,7],[28,2,28,7],[30,2,30,7],[31,2,31,7]]}
[null,null,"zurück zur Auswahl"]
[]
[null,null,null,{"$f":"MID(CELL(\"dateiname\",A1),FIND(\"]\",CELL(\"dateiname\",A1))+1,255)","v":"17"},"Pistazienschnitten"]
[]
[null,null,null,null,"Zutaten für etwa 50 Stück:",null,null,"(Angabe in Gramm)"]
[]
[null,null,null,null,250,"g","Mehl"]
[null,null,null,null,2,"TL","Zimt"]
[null,null,null,null,1,"Pr.","Salz"]
[null,null,null,null,130,"g","Puderzucker"]
[null,null,null,null,1,"St.","Eigelb"]
[null,null,null,null,1,"St.","Ei"]
[null,null,null,null,100,"g","Butter"]
[null,null,null,null,100,"g","gehackte Pistazien"]
[null,null,null,null,450,"g","Marzipanrohmasse"]
[null,null,null,null,5,"EL","Sahne"]
[null,null,null,null,"1-2","TL ","Rum"]
[]
[]
[]
[]
[]
[]
[]
[]
[]
[null,1,"Mehl und Zimt, Salz, 80 g Puderzucker, Ei, Eigelb sowie Butter in Würfel rasch verkneten. "]
[null,null,"Den Mürbeteig zu einer Kigel formen und in einer Frischaltefolie wicklen und ca. 2 Std. "]
[null,null,"in den Kühlschrank legen."]
[null,2,"Den Backofen auf 180 Grad (Umluft 160 Grad) vorheizen. "]
[null,null,"Ca. 70 g Pistazien feinmahlen und mit dem Marzipan verkneten. Pistazienmarzipan dritteln"]
[null,null,"und zu ca. 30 cm langen Rollen formen. "]
[null,null,"Mürbetig ebenfalls dritteln und und rechteckig (10 x 30 cm) ausrollen. Den Teig mit der"]
[null,null,"Sahne bestreichen, die Marzipanrollen darauflegen und den Teig einrollen."]
[null,null,"Rollen mit der Naht nach unten auf das mit Backpapier belegte Blech legen und im Ofen"]
[null,null,"ca. 20-25 Minuten backen."]
[null,3,"Den übrigen Puderzucker mit Rum glatt rühren. Gebäck aus dem Ofen nehmen und "]
[null,null,"noch heiß mit der Glasur bestreichen. Die übrigen Pistazien darüberstreuen und in ca."]
[null,null,"1,5 cm Dicke Scheiben schneiden."]
[]
[]
[]
[]
[]
[]
[]
[]
[]
[]
[null,null,"Backen:",180,"Ober- und Unterhitze"]
[null,null,null,160,"Umluft"]
[null,null,null,"20-25","Minuten"]
[]
[]
[]
[]
[null,null,null,null,null,null,null,"Quelle: LISA Kochen & Backen 11/2009"]

{"sheet":"20","index":10,"n_rows":57,"n_cols":8,"rows_kept":57,"cut":false,"hidden":false,"merged":[[32,2,32,7],[33,2,33,7],[34,2,34,7],[35,2,35,7],[2,4,2,7],[26,2,26,7],[27,2,27,7],[28,2,28,7],[31,2,31,7],[30,2,30,7]]}
[null,null,"zurück zur Auswahl"]
[]
[null,null,null,{"$f":"MID(CELL(\"dateiname\",A1),FIND(\"]\",CELL(\"dateiname\",A1))+1,255)","v":"20"},"Marmorhappen"]
[]
[null,null,null,null,"Zutaten für etwa 40 Stück:",null,null,"(Angabe in Gramm)"]
[]
[null,null,null,null,290,"g","Mehl"]
[null,null,null,null,1,"TL","Backpulver"]
[null,null,null,null,125,"g","Puderzucker"]
[null,null,null,null,1,"Pr","Salz"]
[null,null,null,null,150,"g","Butter"]
[null,null,null,null,1,"St.","Eigelb"]
[null,null,null,null,3,"TL","Kakopulver"]
[null,null,null,null,3,"EL","Milch"]
[]
[]
[]
[]
[]
[]
[]
[]
[]
[]
[]
[]
[null,1,"Mehl, Backpulver, Puderzucker und Salz mischen, dann mit Butter in Stückchen "]
[null,null,"verkneten und dann das Eigelb untermengen."]
[null,null,"Eine Hälfte des Teiges mit Kakao vermischen."]
[null,null,"Alles zugedeckt ca. 2 Stunden kühl stellen."]
[null,2,"Hellen und dunklen Teig viereckig ca. 1 cm dick ausrollen und in gleich lange, "]
[null,null,"ca. 1 cm breite Streifen schneiden. Helle Teilstreifen an einer Längsseite mit Milch"]
[null,null,"bepinseln und den dunklen Streifen andrücken. Die Oberfläche mit Milch bestreichen"]
[null,null,"und 2 weitere Teilstreifen farbversetzt anlegen und gut andrücken."]
[null,null,"Den Teig ca. 15 min. frosten."]
[null,null,"Den Teig in ca. 2 mm dicke Scheiben schneiden und auf das Backpapier legen."]
[]
[]
[]
[]
[]
[]
[]
[]
[]
[]
[]
[]
[]
[null,null,"Backen:",175,"Ober- und Unterhitze"]
[null,null,null,155,"Umluft"]
[null,null,null,8,"Minuten"]
[]
[]
[]
[]
[null,null,null,null,null,null,null,"Quelle: LISA Kochen & Backen 11/2010"]

{"sheet":"Maßtabellen","index":11,"n_rows":2,"n_cols":3,"rows_kept":2,"cut":false,"hidden":false,"merged":[]}
[null,"TL","EL"]
["Kakopulver",3,10]